program: Orca
programVersion: 5.0.3
elementType: Cl O O N N N N N C C C C C C C C C H H H H H H H H H H
charge: 0
multiplicity: 1
keywords: wb97x-d3
keywords: def2-TZVPP
keywords: def2/J RIJCOSX
keywords: DEFGRID2
keywords: scfconv7
keywords: smallprint printgap noloewdin
keywords: NOSOSCF
formula: C9H10ClN5O2
InChI: InChI=1/C9H10ClN5O2/c10-8-2-1-7(5-12-8)6-14-4-3-11-9(14)13-15(16)17/h1-2,5,11H,3-4,6H2
27 atoms
Cl 4.870694 -0.684691 -0.756912
O  -3.423506 -2.745586 0.376226
O  -4.047088 -1.264764 -1.030438
N  -1.31825 1.157791 0.578534
N  -2.71824 1.008424 -1.09474
N  -2.39992 -0.855963 0.436341
N  2.347048 -1.049482 -0.249847
N  -3.328356 -1.633859 -0.10693
C  -1.082605 2.370602 -0.18755
C  -2.276724 2.390627 -1.139865
C  -0.398491 0.72922 1.60675
C  -2.206491 0.367864 -0.046536
C  0.96725 0.401189 1.061558
C  2.061715 1.228054 1.282639
C  1.175666 -0.734417 0.288569
C  3.292509 0.907018 0.736381
C  3.358885 -0.246734 -0.026498
H  -0.133105 2.307553 -0.726554
H  -1.048508 3.242683 0.463991
H  -3.06807 3.05717 -0.791284
H  -2.000102 2.681375 -2.150905
H  -0.829219 -0.132456 2.11324
H  -0.317886 1.529781 2.344104
H  -3.529136 0.665503 -1.581895
H  1.957336 2.124828 1.881579
H  0.362386 -1.425327 0.094195
H  4.159333 1.533113 0.892762
elementType: Cl O N C H
totalener: -1233.39527530 hartree
nucrepener: 1296.62763340 hartree
electener: -2530.02290871 hartree
oneelecener: -4261.90954483 hartree
twoeener: 1731.88663613 hartree
cpcmener: -0.04160965 hartree
kineticenergy: 1229.70162642 hartree
xcener: -93.453035123398 hartree
chargesum: -0.0000000
charge: -0.087653 -0.443629 -0.469228 -0.127297 -0.194422 -0.363445 -0.323044 0.527553 -0.034538 -0.016408 0.018132 0.357546 -0.059897 -0.147216 0.024229 -0.140786 0.180300 0.099266 0.108673 0.103244 0.103565 0.128244 0.127938 0.193582 0.148497 0.137490 0.149304
qa: -0.0877 -0.4436 -0.4692 -0.1273 -0.1944 -0.3634 -0.3230 0.5276 -0.0345 -0.0164 0.0181 0.3575 -0.0599 -0.1472 0.0242 -0.1408 0.1803 0.0993 0.1087 0.1032 0.1036 0.1282 0.1279 0.1936 0.1485 0.1375 0.1493
va: 1.2141 1.8043 1.7930 3.2119 3.2888 2.7166 3.0549 4.3401 3.9060 3.9503 3.7728 4.2411 3.6279 3.9803 4.0234 3.9446 4.1367 0.9966 1.0000 1.0025 1.0016 1.0218 0.9967 1.0247 1.0031 1.0200 1.0024
dispcorr: -0.011844866 hartree
energy: -1233.407120168050
dipole: -10.97266 11.78017 0.80751 15.56526 -10.17495 5.39032 3.32002 -2.78470 0.53532
magnitude: 5.47669 au
magnitude: 13.92065 debye
