program: Orca
programVersion: 5.0.3
elementType: Cl O O N N N N N C C C C C C C C C H H H H H H H H H H
charge: 0
multiplicity: 1
keywords: wb97x-d3
keywords: def2-TZVPP
keywords: def2/J RIJCOSX
keywords: DEFGRID2
keywords: scfconv7
keywords: smallprint printgap noloewdin
keywords: NOSOSCF
formula: C9H10ClN5O2
InChI: InChI=1/C9H10ClN5O2/c10-8-2-1-7(5-12-8)6-14-4-3-11-9(14)13-15(16)17/h1-2,5,11H,3-4,6H2
27 atoms
Cl 4.738427 -0.840111 -0.754609
O  -3.075377 -2.73904 0.521964
O  -3.78261 -1.409636 -0.992664
N  -1.356854 1.352085 0.556073
N  -2.706251 0.989517 -1.128584
N  -2.260214 -0.749427 0.5162
N  3.117728 0.929026 0.245164
N  -3.076236 -1.649901 -0.019521
C  -1.185982 2.516944 -0.298488
C  -2.381144 2.400137 -1.240407
C  -0.393722 1.02996 1.587908
C  -2.163281 0.455215 -0.037341
C  0.896783 0.492462 1.030731
C  1.0578 -0.854997 0.715376
C  1.969412 1.334804 0.778237
C  2.24698 -1.292163 0.16322
C  3.232698 -0.340581 -0.052028
H  -0.236512 2.46383 -0.839712
H  -1.197973 3.435198 0.286275
H  -3.221946 3.015318 -0.913018
H  -2.134205 2.666404 -2.265783
H  -0.842969 0.316244 2.275882
H  -0.207668 1.944351 2.15278
H  -3.484639 0.558978 -1.599373
H  0.258273 -1.560885 0.899724
H  1.905414 2.390368 1.02166
H  2.400651 -2.331673 -0.089333
elementType: Cl O N C H
totalener: -1233.39606570 hartree
nucrepener: 1305.55161452 hartree
electener: -2538.94768021 hartree
oneelecener: -4279.73726843 hartree
twoeener: 1740.78958822 hartree
cpcmener: -0.03823930 hartree
kineticenergy: 1229.70528292 hartree
xcener: -93.452724062790 hartree
chargesum: 0.0000000
charge: -0.087723 -0.443294 -0.466388 -0.133615 -0.192384 -0.362330 -0.325300 0.531411 -0.034591 -0.020786 0.028906 0.364327 -0.066508 -0.110589 -0.005826 -0.166767 0.193066 0.098322 0.108682 0.104058 0.104123 0.121871 0.128624 0.192404 0.152414 0.138738 0.149155
qa: -0.0877 -0.4433 -0.4664 -0.1336 -0.1924 -0.3623 -0.3253 0.5314 -0.0346 -0.0208 0.0289 0.3643 -0.0665 -0.1106 -0.0058 -0.1668 0.1931 0.0983 0.1087 0.1041 0.1041 0.1219 0.1286 0.1924 0.1524 0.1387 0.1492
va: 1.2142 1.8054 1.7947 3.2130 3.2951 2.7205 3.0422 4.3436 3.9109 3.9560 3.7892 4.2428 3.6265 3.9583 4.0460 3.9815 4.1278 0.9983 1.0003 1.0029 1.0017 1.0167 0.9967 1.0238 1.0206 1.0056 1.0034
dispcorr: -0.012019181 hartree
energy: -1233.408084877668
dipole: -12.92996 12.58593 -0.34403 13.23475 -9.44622 3.78854 1.85250 -1.99944 -0.14694
magnitude: 3.80696 au
magnitude: 9.67653 debye
