program: Orca
programVersion: 5.0.3
elementType: Cl O O N N N N N C C C C C C C C C H H H H H H H H H H
charge: 0
multiplicity: 1
keywords: wb97x-d3
keywords: def2-TZVPP
keywords: def2/J RIJCOSX
keywords: DEFGRID2
keywords: scfconv7
keywords: smallprint printgap noloewdin
keywords: NOSOSCF
formula: C9H10ClN5O2
InChI: InChI=1/C9H10ClN5O2/c10-8-2-1-7(5-12-8)6-14-4-3-11-9(14)13-15(16)17/h1-2,5,11H,3-4,6H2
27 atoms
Cl 4.710539 -0.857027 -0.750661
O  -2.957682 -2.768755 0.436092
O  -3.855177 -1.355636 -0.895661
N  -1.367338 1.379488 0.573412
N  -2.678157 0.968527 -1.138937
N  -2.217235 -0.745433 0.518309
N  3.122569 0.92151 0.281977
N  -3.056684 -1.661179 -0.019946
C  -1.17499 2.505799 -0.317775
C  -2.383331 2.380783 -1.245829
C  -0.399285 1.05295 1.599161
C  -2.146034 0.445281 -0.024897
C  0.886679 0.506787 1.040181
C  1.023131 -0.837196 0.692869
C  1.978892 1.330822 0.815611
C  2.209424 -1.277681 0.141603
C  3.22023 -0.341419 -0.044589
H  -0.232417 2.418982 -0.870413
H  -1.163655 3.446919 0.231867
H  -3.222868 2.990572 -0.897679
H  -2.15248 2.665173 -2.271563
H  -0.859385 0.339163 2.279959
H  -0.208761 1.96421 2.169688
H  -3.451781 0.504963 -1.585114
H  0.203197 -1.52571 0.852838
H  1.937658 2.382113 1.087042
H  2.35151 -2.311597 -0.137261
totalener: -1233.36703775 hartree
nucrepener: 1308.79600449 hartree
electener: -2542.16304224 hartree
oneelecener: -4286.36643005 hartree
twoeener: 1744.20338780 hartree
kineticenergy: 1229.73569347 hartree
xcener: -93.453564155137 hartree
chargesum: 0.0000000
charge: -0.062090 -0.331849 -0.417287 -0.139927 -0.206340 -0.336694 -0.263042 0.484430 -0.062880 -0.043385 -0.015287 0.359900 -0.058889 -0.102047 -0.036052 -0.163485 0.188416 0.095139 0.097641 0.095940 0.097627 0.127238 0.115989 0.176928 0.161384 0.107567 0.131055
qa: -0.0621 -0.3318 -0.4173 -0.1399 -0.2063 -0.3367 -0.2630 0.4844 -0.0629 -0.0434 -0.0153 0.3599 -0.0589 -0.1020 -0.0361 -0.1635 0.1884 0.0951 0.0976 0.0959 0.0976 0.1272 0.1160 0.1769 0.1614 0.1076 0.1311
va: 1.2382 1.9329 1.8369 3.1506 3.2557 2.7379 3.0770 4.4033 3.9290 3.9776 3.8185 4.2230 3.5671 3.9535 4.0829 4.0022 4.1368 0.9971 0.9997 0.9993 0.9998 1.0194 0.9963 1.0461 1.0220 1.0068 1.0126
dispcorr: -0.012080381 hartree
energy: -1233.379118134133
dipole: -12.92989 12.60746 -0.32243 13.23777 -10.75322 2.48455 1.75070 -1.88602 -0.13532
magnitude: 2.50904 au
magnitude: 6.37746 debye
