program: Orca
programVersion: 5.0.2
elementType: Cl F F F O N N N C C C C C C C C C C C C C H H H H H H H H H
charge: 0
multiplicity: 1
keywords: wb97x-d3
keywords: def2-TZVPP
keywords: def2/J RIJCOSX
keywords: DEFGRID2
keywords: scfconv7
keywords: smallprint printgap noloewdin
keywords: NOSOSCF
formula: C13H9ClF3N3O
InChI: InChI=1/C13H9ClF3N3O/c14-10-5-4-9(7-18-10)8-20-6-2-1-3-11(20)19-12(21)13(15,16)17/h1-7H,8H2
30 atoms
Cl 3.937322 2.957589 1.843424
F  0.221012 -4.442567 0.527601
F  1.322554 -2.891149 -0.475695
F  -0.360756 -3.826703 -1.447857
O  -1.291156 -2.532504 1.453229
N  -1.704647 0.82353 -0.972086
N  -0.985351 -1.29993 -0.495524
N  1.509787 2.156652 1.358071
C  -0.449633 1.048817 -1.684525
C  0.659162 1.526733 -0.788803
C  -1.913825 -0.360935 -0.316993
C  -2.582919 1.852055 -0.912855
C  -3.122488 -0.47362 0.405794
C  1.904774 1.799002 -1.350221
C  -3.747986 1.759907 -0.218239
C  -4.018229 0.559524 0.449177
C  0.520535 1.728355 0.574027
C  2.936218 2.247844 -0.551258
C  2.667817 2.400597 0.801003
C  -0.84385 -2.32673 0.330124
C  0.096033 -3.384734 -0.270745
H  -0.640812 1.787874 -2.462109
H  -0.16076 0.127197 -2.184045
H  -2.302126 2.744175 -1.453435
H  -3.342149 -1.39645 0.916714
H  2.067045 1.664041 -2.412413
H  -4.430019 2.595878 -0.197205
H  -0.41893 1.548323 1.082699
H  -4.938889 0.443256 1.005001
H  3.910167 2.470872 -0.962259
elementType: Cl F O N C H
totalener: -1500.16250914 hartree
nucrepener: 1787.67278512 hartree
electener: -3287.83529426 hartree
oneelecener: -5613.39364763 hartree
twoeener: 2325.55835337 hartree
cpcmener: -0.05120758 hartree
kineticenergy: 1495.55980472 hartree
xcener: -114.984008061088 hartree
chargesum: -0.0000000
charge: -0.089891 -0.177654 -0.179879 -0.180527 -0.531729 -0.028659 -0.491865 -0.332956 0.076122 0.001502 0.318049 0.061975 -0.207181 -0.172227 -0.190403 -0.066391 0.022360 -0.149223 0.188384 0.294087 0.486261 0.135346 0.132333 0.168722 0.147419 0.154374 0.168830 0.119641 0.171795 0.151385
qa: -0.0899 -0.1777 -0.1799 -0.1805 -0.5317 -0.0287 -0.4919 -0.3330 0.0761 0.0015 0.3180 0.0620 -0.2072 -0.1722 -0.1904 -0.0664 0.0224 -0.1492 0.1884 0.2941 0.4863 0.1353 0.1323 0.1687 0.1474 0.1544 0.1688 0.1196 0.1718 0.1514
va: 1.2124 1.1299 1.1140 1.1136 1.9474 3.4320 2.8588 3.0544 3.6879 3.6638 3.9429 3.8813 3.9522 4.0310 3.8952 3.9420 4.0188 3.9441 4.1271 4.2035 4.4276 0.9942 1.0240 0.9891 1.0207 0.9987 0.9889 1.0191 0.9838 1.0025
dispcorr: -0.013802523 hartree
energy: -1500.176311665925
dipole: -16.30044 13.91504 -2.38540 17.74480 -13.83802 3.90678 -7.57189 4.22659 -3.34531
magnitude: 5.66958 au
magnitude: 14.41093 debye
