program: Orca
programVersion: 5.0.2
elementType: Cl F F F O N N N C C C C C C C C C C C C C H H H H H H H H H
charge: 0
multiplicity: 1
keywords: wb97x-d3
keywords: def2-TZVPP
keywords: def2/J RIJCOSX
keywords: DEFGRID2
keywords: scfconv7
keywords: smallprint printgap noloewdin
keywords: NOSOSCF
formula: C13H9ClF3N3O
InChI: InChI=1/C13H9ClF3N3O/c14-10-5-4-9(7-18-10)8-20-6-2-1-3-11(20)19-12(21)13(15,16)17/h1-7H,8H2
30 atoms
Cl 4.104568 2.30079 -0.657263
F  1.637273 -2.437931 -0.26935
F  0.29341 -4.060608 -0.713487
F  0.218059 -3.102354 1.207995
O  -0.679547 -1.857978 -1.92064
N  -2.190023 0.870197 0.72613
N  -1.194997 -1.123626 0.221182
N  1.585796 2.718815 -0.162582
C  -1.163341 1.035086 1.765331
C  0.190865 1.309619 1.177787
C  -2.127964 -0.22078 -0.094502
C  -3.122573 1.836079 0.576846
C  -3.092308 -0.305714 -1.117175
C  1.27059 0.468048 1.413323
C  -4.063899 1.771827 -0.405515
C  -4.043067 0.670333 -1.266149
C  0.410229 2.425072 0.385262
C  2.501962 0.762988 0.85879
C  2.583866 1.902594 0.075416
C  -0.613848 -1.875763 -0.692163
C  0.382242 -2.880412 -0.094095
H  -1.140377 0.141721 2.384755
H  -1.48219 1.863333 2.395564
H  -3.075803 2.655282 1.278594
H  -3.089498 -1.164614 -1.768885
H  1.151918 -0.413417 2.029298
H  -4.797202 2.558174 -0.497588
H  -0.394107 3.121359 0.174017
H  -4.780498 0.582547 -2.052598
H  3.360025 0.12791 1.024167
elementType: Cl F O N C H
totalener: -1500.16249314 hartree
nucrepener: 1836.75887186 hartree
electener: -3336.92136500 hartree
oneelecener: -5711.71090841 hartree
twoeener: 2374.78954342 hartree
cpcmener: -0.05215718 hartree
kineticenergy: 1495.58253042 hartree
xcener: -114.987146118498 hartree
chargesum: 0.0000000
charge: -0.089745 -0.181908 -0.181038 -0.178095 -0.559572 -0.003057 -0.477382 -0.333638 0.051104 0.010285 0.336882 0.062734 -0.226058 -0.185645 -0.195069 -0.058114 0.015803 -0.140422 0.185394 0.295183 0.492853 0.130375 0.134752 0.171616 0.146676 0.148515 0.168850 0.136004 0.171468 0.151252
qa: -0.0897 -0.1819 -0.1810 -0.1781 -0.5596 -0.0031 -0.4774 -0.3336 0.0511 0.0103 0.3369 0.0627 -0.2261 -0.1856 -0.1951 -0.0581 0.0158 -0.1404 0.1854 0.2952 0.4929 0.1304 0.1348 0.1716 0.1467 0.1485 0.1689 0.1360 0.1715 0.1513
va: 1.2132 1.1056 1.1212 1.1226 1.9304 3.4636 2.8666 3.0446 3.7392 3.5885 3.9538 3.8826 3.9680 3.9978 3.9012 3.9291 4.0527 3.9515 4.1343 4.1944 4.4234 1.0155 0.9984 0.9884 1.0177 1.0167 0.9891 1.0102 0.9838 1.0025
dispcorr: -0.015332299 hartree
energy: -1500.177825434053
dipole: -20.95777 17.08255 -3.87522 14.72997 -12.04496 2.68500 5.34732 -2.54314 2.80419
magnitude: 5.48544 au
magnitude: 13.94288 debye
