program: Orca
programVersion: 5.0.2
elementType: Cl F F F O N N N C C C C C C C C C C C C C H H H H H H H H H
charge: 0
multiplicity: 1
keywords: wb97x-d3
keywords: def2-TZVPP
keywords: def2/J RIJCOSX
keywords: DEFGRID2
keywords: scfconv7
keywords: smallprint printgap noloewdin
keywords: NOSOSCF
formula: C13H9ClF3N3O
InChI: InChI=1/C13H9ClF3N3O/c14-10-5-4-9(7-18-10)8-20-6-2-1-3-11(20)19-12(21)13(15,16)17/h1-7H,8H2
30 atoms
Cl 4.249399 1.829634 -0.957568
F  0.718744 -3.868096 -0.115741
F  0.820961 -2.459459 1.508305
F  1.332903 -1.838776 -0.491482
O  -1.718023 -3.01396 -0.550208
N  -2.229778 1.041956 0.601093
N  -1.14571 -0.933424 0.336177
N  2.544578 1.129236 0.879294
C  -1.135371 1.424303 1.500636
C  0.188729 1.550089 0.806805
C  -2.214158 -0.204911 0.029627
C  -3.203673 1.942946 0.349044
C  -3.291647 -0.521561 -0.826067
C  0.34204 2.206134 -0.407435
C  -4.244902 1.657533 -0.48107
C  -4.279733 0.393519 -1.078037
C  1.327544 1.029627 1.401279
C  1.600354 2.299445 -0.975058
C  2.656054 1.73692 -0.277071
C  -0.965465 -2.187297 -0.048318
C  0.491124 -2.600251 0.220107
H  -1.071735 0.698024 2.3085
H  -1.414434 2.377459 1.947198
H  -3.109764 2.895767 0.848169
H  -3.324171 -1.493078 -1.289477
H  -0.507279 2.639507 -0.9214
H  -5.008808 2.398372 -0.659234
H  1.257028 0.512025 2.351135
H  -5.089963 0.130976 -1.74498
H  1.752244 2.79296 -1.924087
elementType: Cl F O N C H
totalener: -1500.16110323 hartree
nucrepener: 1841.88819276 hartree
electener: -3342.04929599 hartree
oneelecener: -5722.28620833 hartree
twoeener: 2380.23691234 hartree
cpcmener: -0.05208769 hartree
kineticenergy: 1495.59202311 hartree
xcener: -114.989348934096 hartree
chargesum: 0.0000000
charge: -0.092967 -0.178590 -0.184641 -0.182706 -0.523472 -0.015400 -0.477450 -0.318835 0.069235 0.046754 0.341220 0.058688 -0.220699 -0.140203 -0.193082 -0.070193 -0.058475 -0.157327 0.178868 0.250506 0.522093 0.126828 0.126086 0.168234 0.149777 0.153518 0.168263 0.132519 0.171014 0.150439
qa: -0.0930 -0.1786 -0.1846 -0.1827 -0.5235 -0.0154 -0.4774 -0.3188 0.0692 0.0468 0.3412 0.0587 -0.2207 -0.1402 -0.1931 -0.0702 -0.0585 -0.1573 0.1789 0.2505 0.5221 0.1268 0.1261 0.1682 0.1498 0.1535 0.1683 0.1325 0.1710 0.1504
va: 1.2088 1.1309 1.1096 1.1065 1.9585 3.4549 2.8229 3.0246 3.7279 3.5974 3.9367 3.8815 3.9368 3.9895 3.8971 3.9406 4.0783 3.9558 4.1284 4.2502 4.3650 1.0141 0.9986 0.9905 1.0339 0.9979 0.9890 1.0159 0.9849 1.0033
dispcorr: -0.015190435 hartree
energy: -1500.176293660576
dipole: -23.84350 19.64173 -4.20177 17.26953 -12.49076 4.77877 1.26579 -0.98836 0.27743
magnitude: 6.36934 au
magnitude: 16.18958 debye
