program: Orca
programVersion: 5.0.2
elementType: Cl F F F O N N N C C C C C C C C C C C C C H H H H H H H H H
charge: 0
multiplicity: 1
keywords: wb97x-d3
keywords: def2-TZVPP
keywords: def2/J RIJCOSX
keywords: DEFGRID2
keywords: scfconv7
keywords: smallprint printgap noloewdin
keywords: NOSOSCF
formula: C13H9ClF3N3O
InChI: InChI=1/C13H9ClF3N3O/c14-10-5-4-9(7-18-10)8-20-6-2-1-3-11(20)19-12(21)13(15,16)17/h1-7H,8H2
30 atoms
Cl 4.163012 3.392633 -0.537777
F  0.06923 -4.53268 -1.084717
F  -0.550169 -4.001573 0.905396
F  1.152971 -3.030905 0.006074
O  -1.529395 -2.63165 -1.893552
N  -1.730388 0.671963 0.736233
N  -1.081526 -1.405686 0.038335
N  2.570446 1.372243 -0.170342
C  -0.613996 0.663331 1.699109
C  0.585305 1.391604 1.163469
C  -1.923465 -0.387475 -0.113597
C  -2.516748 1.770627 0.718828
C  -3.01636 -0.279353 -1.007738
C  0.818058 2.726737 1.476808
C  -3.563625 1.893687 -0.140723
C  -3.814539 0.831575 -1.017228
C  1.504664 0.762115 0.334327
C  1.924992 3.373749 0.958619
C  2.758193 2.632023 0.136625
C  -1.01002 -2.428944 -0.806479
C  -0.070806 -3.511077 -0.244162
H  -0.377977 -0.369907 1.9318
H  -0.972222 1.141894 2.608865
H  -2.265601 2.541488 1.433225
H  -3.215999 -1.092037 -1.685236
H  0.142425 3.263201 2.132089
H  -4.172765 2.784618 -0.125668
H  1.383633 -0.282052 0.073266
H  -4.644178 0.884449 -1.710094
H  2.132293 4.408628 1.190789
elementType: Cl F O N C H
totalener: -1500.16607289 hartree
nucrepener: 1777.58440357 hartree
electener: -3277.75047646 hartree
oneelecener: -5592.87683553 hartree
twoeener: 2315.12635907 hartree
cpcmener: -0.03976557 hartree
kineticenergy: 1495.57854148 hartree
xcener: -114.984269295343 hartree
chargesum: -0.0000000
charge: -0.083919 -0.175452 -0.182286 -0.177899 -0.488663 -0.004378 -0.498243 -0.322371 0.026522 -0.051292 0.355017 0.078506 -0.230197 -0.132906 -0.213501 -0.065548 0.016240 -0.160895 0.189334 0.261746 0.493770 0.139382 0.143026 0.162771 0.151445 0.153310 0.165390 0.135254 0.167494 0.148341
qa: -0.0839 -0.1755 -0.1823 -0.1779 -0.4887 -0.0044 -0.4982 -0.3224 0.0265 -0.0513 0.3550 0.0785 -0.2302 -0.1329 -0.2135 -0.0655 0.0162 -0.1609 0.1893 0.2617 0.4938 0.1394 0.1430 0.1628 0.1514 0.1533 0.1654 0.1353 0.1675 0.1483
va: 1.2184 1.1339 1.1088 1.1100 2.0000 3.4466 2.8148 3.0589 3.7056 3.6325 3.9333 3.8823 3.9617 4.0055 3.9432 3.9391 4.0352 3.9722 4.1349 4.2272 4.4126 1.0355 0.9964 0.9915 1.0329 1.0001 0.9917 1.0359 0.9863 1.0036
dispcorr: -0.013888562 hartree
energy: -1500.179961448938
dipole: -17.66346 14.71163 -2.95183 18.66630 -14.28457 4.38173 6.35009 -3.72809 2.62201
magnitude: 5.89812 au
magnitude: 14.99183 debye
