program: Orca
programVersion: 5.0.2
elementType: Cl F F F O N N N C C C C C C C C C C C C C H H H H H H H H H
charge: 0
multiplicity: 1
keywords: wb97x-d3
keywords: def2-TZVPP
keywords: def2/J RIJCOSX
keywords: DEFGRID2
keywords: scfconv7
keywords: smallprint printgap noloewdin
keywords: NOSOSCF
formula: C13H9ClF3N3O
InChI: InChI=1/C13H9ClF3N3O/c14-10-5-4-9(7-18-10)8-20-6-2-1-3-11(20)19-12(21)13(15,16)17/h1-7H,8H2
30 atoms
Cl 4.078618 3.41509 1.397419
F  -0.232825 -4.811988 0.288581
F  0.913398 -3.074483 0.838845
F  0.533868 -3.505432 -1.239194
O  -2.343675 -3.267979 0.308149
N  -1.574023 0.718387 -0.774824
N  -1.020597 -1.432224 -0.241947
N  2.317247 1.552283 0.969335
C  -0.344939 0.801578 -1.580924
C  0.769479 1.495278 -0.851939
C  -1.909145 -0.448666 -0.139643
C  -2.330225 1.835155 -0.691493
C  -3.119837 -0.439123 0.593702
C  1.293469 2.692061 -1.324537
C  -3.48728 1.866248 0.022385
C  -3.881447 0.693633 0.679217
C  1.33005 0.965497 0.304312
C  2.33129 3.307146 -0.647038
C  2.789685 2.681121 0.499293
C  -1.294786 -2.698226 0.049839
C  -0.007332 -3.537184 -0.015819
H  -0.592704 1.343762 -2.492257
H  -0.060391 -0.20778 -1.861978
H  -1.959118 2.696557 -1.228678
H  -3.423991 -1.336234 1.106943
H  0.898452 3.144909 -2.225342
H  -4.06954 2.773876 0.068123
H  0.977392 0.024616 0.71053
H  -4.793546 0.678835 1.261335
H  2.760448 4.234937 -0.997201
elementType: Cl F O N C H
totalener: -1500.16601453 hartree
nucrepener: 1772.25556280 hartree
electener: -3272.42157733 hartree
oneelecener: -5582.16875302 hartree
twoeener: 2309.74717568 hartree
cpcmener: -0.03918216 hartree
kineticenergy: 1495.59058839 hartree
xcener: -114.986622563495 hartree
chargesum: 0.0000000
charge: -0.085220 -0.175264 -0.179912 -0.181073 -0.491693 -0.014129 -0.500584 -0.323495 0.046497 -0.052724 0.364328 0.076109 -0.222662 -0.137353 -0.206701 -0.065009 0.017009 -0.156311 0.188200 0.258407 0.490577 0.140989 0.137510 0.163436 0.149233 0.149692 0.165583 0.128137 0.167730 0.148694
qa: -0.0852 -0.1753 -0.1799 -0.1811 -0.4917 -0.0141 -0.5006 -0.3235 0.0465 -0.0527 0.3643 0.0761 -0.2227 -0.1374 -0.2067 -0.0650 0.0170 -0.1563 0.1882 0.2584 0.4906 0.1410 0.1375 0.1634 0.1492 0.1497 0.1656 0.1281 0.1677 0.1487
va: 1.2168 1.1341 1.1092 1.1111 1.9987 3.4515 2.7984 3.0595 3.6953 3.6470 3.8897 3.8853 3.9645 4.0028 3.9233 3.9399 4.0336 3.9650 4.1308 4.2515 4.4064 0.9937 1.0320 0.9914 1.0292 1.0022 0.9911 1.0377 0.9858 1.0038
dispcorr: -0.013751305 hartree
energy: -1500.179765835914
dipole: -16.56109 14.49832 -2.06277 18.61749 -13.95916 4.65833 -7.19665 5.10381 -2.09283
magnitude: 5.50772 au
magnitude: 13.99951 debye
