program: Orca
programVersion: 5.0.2
elementType: Cl F F F O N N N C C C C C C C C C C C C C H H H H H H H H H
charge: 0
multiplicity: 1
keywords: wb97x-d3
keywords: def2-TZVPP
keywords: def2/J RIJCOSX
keywords: DEFGRID2
keywords: scfconv7
keywords: smallprint printgap noloewdin
keywords: NOSOSCF
formula: C13H9ClF3N3O
InChI: InChI=1/C13H9ClF3N3O/c14-10-5-4-9(7-18-10)8-20-6-2-1-3-11(20)19-12(21)13(15,16)17/h1-7H,8H2
30 atoms
Cl 4.046962 2.868648 -0.947879
F  -0.773297 -3.855099 0.983196
F  1.103176 -2.802036 0.904056
F  0.567417 -4.158208 -0.674689
O  -0.692209 -2.163873 -1.809577
N  -2.002725 0.844358 0.732349
N  -1.054196 -1.180097 0.261646
N  1.557394 3.065341 -0.231076
C  -0.93758 1.047495 1.722392
C  0.353311 1.455626 1.067104
C  -1.967549 -0.272948 -0.058479
C  -2.954439 1.79667 0.598958
C  -2.958063 -0.368623 -1.065015
C  1.493002 0.66449 1.133836
C  -3.923835 1.711615 -0.350468
C  -3.913815 0.59854 -1.202494
C  0.448598 2.652571 0.370733
C  2.658068 1.084803 0.517316
C  2.615965 2.296482 -0.152635
C  -0.627362 -2.103565 -0.592207
C  0.083848 -3.241725 0.158441
H  -0.808145 0.131836 2.294891
H  -1.280943 1.820759 2.407739
H  -2.894802 2.626287 1.288137
H  -2.962508 -1.232447 -1.710544
H  1.475404 -0.274637 1.669476
H  -4.669406 2.488278 -0.429831
H  -0.404505 3.318468 0.290883
H  -4.668001 0.497865 -1.971984
H  3.559676 0.489822 0.552829
elementType: Cl F O N C H
totalener: -1500.16687952 hartree
nucrepener: 1806.86191540 hartree
electener: -3307.02879492 hartree
oneelecener: -5651.51818710 hartree
twoeener: 2344.48939217 hartree
cpcmener: -0.03867803 hartree
kineticenergy: 1495.58599298 hartree
xcener: -114.985674281662 hartree
chargesum: 0.0000000
charge: -0.085428 -0.179963 -0.176781 -0.173730 -0.485704 -0.010806 -0.480992 -0.327256 0.039616 -0.019298 0.343505 0.049638 -0.221804 -0.156138 -0.202769 -0.066085 0.020443 -0.144460 0.186805 0.264048 0.488874 0.128681 0.136085 0.168242 0.145314 0.147771 0.164540 0.131057 0.167575 0.149022
qa: -0.0854 -0.1800 -0.1768 -0.1737 -0.4857 -0.0108 -0.4810 -0.3273 0.0396 -0.0193 0.3435 0.0496 -0.2218 -0.1561 -0.2028 -0.0661 0.0204 -0.1445 0.1868 0.2640 0.4889 0.1287 0.1361 0.1682 0.1453 0.1478 0.1645 0.1311 0.1676 0.1490
va: 1.2166 1.1123 1.1130 1.1354 2.0028 3.4402 2.8465 3.0513 3.7434 3.6009 3.9508 3.8909 3.9558 3.9926 3.9042 3.9388 4.0566 3.9648 4.1340 4.2236 4.4055 1.0216 0.9973 0.9887 1.0202 1.0178 0.9911 1.0095 0.9855 1.0028
dispcorr: -0.014524139 hartree
energy: -1500.181403661255
dipole: -18.15306 15.09314 -3.05992 15.44107 -12.97626 2.46481 4.22719 -1.97964 2.24755
magnitude: 4.52657 au
magnitude: 11.50564 debye
