program: Orca
programVersion: 5.0.2
elementType: Cl F F F O N N N C C C C C C C C C C C C C H H H H H H H H H
charge: 0
multiplicity: 1
keywords: wb97x-d3
keywords: def2-TZVPP
keywords: def2/J RIJCOSX
keywords: DEFGRID2
keywords: scfconv7
keywords: smallprint printgap noloewdin
keywords: NOSOSCF
formula: C13H9ClF3N3O
InChI: InChI=1/C13H9ClF3N3O/c14-10-5-4-9(7-18-10)8-20-6-2-1-3-11(20)19-12(21)13(15,16)17/h1-7H,8H2
30 atoms
Cl 4.286039 2.290697 1.19147
F  0.439097 -4.205407 0.027599
F  1.384164 -2.294215 0.340655
F  0.597426 -2.807976 -1.60153
O  -1.738237 -2.949416 0.7844
N  -1.998954 1.000199 -0.672921
N  -1.055968 -1.034796 -0.353342
N  2.671061 0.979261 -0.365481
C  -0.870106 1.282558 -1.564955
C  0.401134 1.571595 -0.819988
C  -2.04896 -0.232985 -0.055069
C  -2.933872 1.957269 -0.473437
C  -3.159894 -0.442923 0.816268
C  0.526593 2.673015 0.018428
C  -3.989137 1.771161 0.35835
C  -4.08964 0.531899 1.01676
C  1.511788 0.752902 -0.964515
C  1.725419 2.911981 0.661323
C  2.764248 2.021612 0.419335
C  -0.965626 -2.294518 0.121161
C  0.381249 -2.919311 -0.285413
H  -1.156682 2.139711 -2.176336
H  -0.735766 0.431383 -2.228858
H  -2.790283 2.875767 -1.023965
H  -3.24016 -1.396666 1.309284
H  -0.305102 3.349731 0.178213
H  -4.718704 2.554355 0.492691
H  1.460929 -0.128601 -1.591461
H  -4.917666 0.345319 1.687914
H  1.85757 3.757463 1.32028
totalener: -1500.13723564 hartree
nucrepener: 1818.50268200 hartree
electener: -3318.63991764 hartree
oneelecener: -5674.67518057 hartree
twoeener: 2356.03526293 hartree
kineticenergy: 1495.62011975 hartree
xcener: -114.987649221264 hartree
chargesum: -0.0000000
charge: -0.061723 -0.155630 -0.169243 -0.180496 -0.369146 -0.014571 -0.462400 -0.255212 -0.039034 0.016859 0.306731 0.016118 -0.190996 -0.111414 -0.176395 -0.068852 0.011129 -0.176994 0.190672 0.227935 0.499382 0.123940 0.129344 0.133791 0.156165 0.111976 0.135490 0.108428 0.141003 0.123141
qa: -0.0617 -0.1556 -0.1692 -0.1805 -0.3691 -0.0146 -0.4624 -0.2552 -0.0390 0.0169 0.3067 0.0161 -0.1910 -0.1114 -0.1764 -0.0689 0.0111 -0.1770 0.1907 0.2279 0.4994 0.1239 0.1293 0.1338 0.1562 0.1120 0.1355 0.1084 0.1410 0.1231
va: 1.2379 1.1638 1.1265 1.1153 2.1153 3.3706 2.8487 3.0815 3.8103 3.5198 4.0423 3.9492 3.9706 3.9975 3.9449 3.9680 4.0910 4.0291 4.1498 4.2450 4.4019 0.9927 1.0279 1.0011 1.0416 1.0100 1.0032 1.0334 0.9966 1.0163
dispcorr: -0.014674217 hartree
energy: -1500.151909856123
dipole: -21.95976 19.50191 -2.45784 18.58385 -15.53170 3.05214 -2.37007 1.88901 -0.48106
magnitude: 3.94816 au
magnitude: 10.03544 debye
