program: Orca
programVersion: 5.0.2
elementType: Cl F F O O N N C C C C C C C C C C C C H H H H H H H H H H H
charge: 0
multiplicity: 1
keywords: wb97x-d3
keywords: def2-TZVPP
keywords: def2/J RIJCOSX
keywords: DEFGRID2
keywords: scfconv7
keywords: smallprint printgap noloewdin
keywords: NOSOSCF
formula: C12H11ClF2N2O2
InChI: InChI=1/C12H11ClF2N2O2/c13-10-2-1-8(4-16-10)5-17(6-11(14)15)9-3-12(18)19-7-9/h1-4,11H,5-7H2
30 atoms
Cl 5.027936 -2.158417 -0.284563
F  -1.28274 3.629995 0.699889
F  -1.537896 3.984112 -1.444415
O  -3.22229 -2.000884 0.535477
O  -4.698047 -1.850307 -1.128068
N  -1.013394 0.808494 0.217301
N  3.542617 -0.611013 1.188923
C  0.026199 0.68182 1.217191
C  -1.978404 -0.109098 0.084768
C  -0.864894 1.842404 -0.784748
C  -2.111541 -1.272156 1.023943
C  1.254766 -0.050298 0.73962
C  -2.96867 -0.199449 -0.842512
C  -1.707054 3.055522 -0.462276
C  -3.735304 -1.377356 -0.5623
C  1.297416 -0.819146 -0.416131
C  2.41618 0.020415 1.497084
C  2.466272 -1.480533 -0.754517
C  3.548292 -1.336628 0.095531
H  -0.376791 0.185421 2.101378
H  0.308282 1.679189 1.554737
H  0.185528 2.13267 -0.851096
H  -1.152852 1.461801 -1.766287
H  -1.223971 -1.90966 1.022868
H  -2.306644 -0.951828 2.050185
H  -3.189435 0.471705 -1.656715
H  -2.771314 2.838386 -0.364765
H  0.435063 -0.914372 -1.064069
H  2.439616 0.616509 2.402634
H  2.526548 -2.084841 -1.648085
elementType: Cl F O N C H
totalener: -1383.88160469 hartree
nucrepener: 1532.91338960 hartree
electener: -2916.79499429 hartree
oneelecener: -4942.05069238 hartree
twoeener: 2025.25569809 hartree
cpcmener: -0.05937953 hartree
kineticenergy: 1379.56779591 hartree
xcener: -105.386096789345 hartree
chargesum: -0.0000000
charge: -0.092618 -0.227045 -0.225274 -0.309032 -0.521904 -0.119279 -0.333209 0.004730 0.120298 -0.061644 0.074767 -0.004703 -0.366682 0.316526 0.392494 -0.116660 -0.020261 -0.173345 0.197964 0.126262 0.125714 0.133227 0.119970 0.129203 0.126741 0.153398 0.107982 0.155989 0.136460 0.149931
qa: -0.0926 -0.2270 -0.2253 -0.3090 -0.5219 -0.1193 -0.3332 0.0047 0.1203 -0.0616 0.0748 -0.0047 -0.3667 0.3165 0.3925 -0.1167 -0.0203 -0.1733 0.1980 0.1263 0.1257 0.1332 0.1200 0.1292 0.1267 0.1534 0.1080 0.1560 0.1365 0.1499
va: 1.2094 1.0427 1.0521 2.0680 1.9816 3.1834 3.0423 3.8327 3.8897 3.7711 3.9638 3.5986 3.7348 4.1285 4.3385 3.9455 4.0966 4.0032 4.1145 0.9961 1.0085 1.0112 1.0095 0.9931 0.9934 1.0074 0.9827 0.9928 1.0076 1.0045
dispcorr: -0.014537538 hartree
energy: -1383.896142223007
dipole: -9.04502 10.44208 1.39706 -0.91367 2.61024 1.69657 2.79567 -1.96780 0.82787
magnitude: 2.34851 au
magnitude: 5.96943 debye
