program: Orca
programVersion: 5.0.2
elementType: Cl F F O O N N C C C C C C C C C C C C H H H H H H H H H H H
charge: 0
multiplicity: 1
keywords: wb97x-d3
keywords: def2-TZVPP
keywords: def2/J RIJCOSX
keywords: DEFGRID2
keywords: scfconv7
keywords: smallprint printgap noloewdin
keywords: NOSOSCF
formula: C12H11ClF2N2O2
InChI: InChI=1/C12H11ClF2N2O2/c13-10-2-1-8(4-16-10)5-17(6-11(14)15)9-3-12(18)19-7-9/h1-4,11H,5-7H2
30 atoms
Cl 4.617728 -2.538274 1.077204
F  -2.948802 2.965645 -0.323717
F  -1.653969 4.367348 0.740596
O  -2.681186 -1.986097 -0.739145
O  -4.343119 -1.891038 0.741427
N  -0.798469 1.043751 -0.403115
N  2.495671 -1.036726 1.191421
C  0.365176 0.903359 -1.257052
C  -1.689987 0.051612 -0.296558
C  -0.864277 2.186804 0.481017
C  -1.597734 -1.176316 -1.153583
C  1.453387 0.035173 -0.679129
C  -2.770936 -0.081821 0.516509
C  -1.647912 3.322793 -0.131663
C  -3.37466 -1.352499 0.24778
C  2.425868 -0.502861 -1.516832
C  1.540559 -0.268446 0.670035
C  3.421997 -1.301532 -0.991628
C  3.393492 -1.528282 0.375757
H  0.758591 1.901799 -1.455482
H  0.066678 0.513216 -2.232026
H  -1.302578 1.905946 1.44115
H  0.148235 2.539649 0.6827
H  -1.698622 -0.938592 -2.215365
H  -0.66088 -1.718659 -1.008013
H  -3.152499 0.607917 1.251045
H  -1.244859 3.662038 -1.086164
H  2.399614 -0.306743 -2.581699
H  0.813809 0.108298 1.37966
H  4.183487 -1.737137 -1.621974
elementType: Cl F O N C H
totalener: -1383.88044632 hartree
nucrepener: 1543.71408193 hartree
electener: -2927.59452826 hartree
oneelecener: -4964.30732907 hartree
twoeener: 2036.71280082 hartree
cpcmener: -0.06618770 hartree
kineticenergy: 1379.59082801 hartree
xcener: -105.390259389713 hartree
chargesum: 0.0000000
charge: -0.091885 -0.224604 -0.225264 -0.310564 -0.524570 -0.124215 -0.333741 0.021999 0.134024 -0.076763 0.073619 -0.045880 -0.365790 0.322344 0.394985 -0.156511 0.045233 -0.154837 0.187693 0.128847 0.128413 0.124692 0.134128 0.129686 0.130664 0.146119 0.102826 0.151365 0.127106 0.150880
qa: -0.0919 -0.2246 -0.2253 -0.3106 -0.5246 -0.1242 -0.3337 0.0220 0.1340 -0.0768 0.0736 -0.0459 -0.3658 0.3223 0.3950 -0.1565 0.0452 -0.1548 0.1877 0.1288 0.1284 0.1247 0.1341 0.1297 0.1307 0.1461 0.1028 0.1514 0.1271 0.1509
va: 1.2101 1.0441 1.0521 2.0650 1.9785 3.1595 3.0573 3.7884 3.8832 3.7856 3.9568 3.6283 3.7497 4.1405 4.3348 4.0275 4.0030 3.9511 4.1274 0.9930 0.9937 1.0113 1.0009 0.9931 0.9966 1.0186 0.9866 1.0002 1.0142 1.0027
dispcorr: -0.014697210 hartree
energy: -1383.895143531895
dipole: -1.63286 5.23733 3.60447 2.75241 0.18334 2.93576 -8.93310 5.72933 -3.20377
magnitude: 5.64579 au
magnitude: 14.35046 debye
