program: Orca
programVersion: 5.0.2
elementType: Cl F F O O N N C C C C C C C C C C C C H H H H H H H H H H H
charge: 0
multiplicity: 1
keywords: wb97x-d3
keywords: def2-TZVPP
keywords: def2/J RIJCOSX
keywords: DEFGRID2
keywords: scfconv7
keywords: smallprint printgap noloewdin
keywords: NOSOSCF
formula: C12H11ClF2N2O2
InChI: InChI=1/C12H11ClF2N2O2/c13-10-2-1-8(4-16-10)5-17(6-11(14)15)9-3-12(18)19-7-9/h1-4,11H,5-7H2
30 atoms
Cl 4.775789 -2.61443 -0.172635
F  -1.555512 4.322752 -1.266056
F  -2.933041 3.023581 -0.168775
O  -2.745252 -1.926733 0.58423
O  -4.287342 -1.944169 -1.024834
N  -0.840596 1.082346 0.182486
N  3.296627 -1.15989 1.400721
C  0.248438 1.011959 1.13793
C  -1.72215 0.080442 0.077435
C  -0.823869 2.151762 -0.792316
C  -1.704753 -1.078664 1.030443
C  1.370248 0.094503 0.718162
C  -2.731398 -0.119446 -0.81077
C  -1.617488 3.347149 -0.31744
C  -3.359958 -1.368134 -0.496325
C  1.555486 -0.341312 -0.588196
C  2.275536 -0.353567 1.669726
C  2.612548 -1.183769 -0.884604
C  3.44396 -1.553123 0.158053
H  -0.131093 0.708163 2.115485
H  0.634754 2.022326 1.280737
H  0.207267 2.46817 -0.956177
H  -1.207963 1.802094 -1.752711
H  -0.757554 -1.62262 1.011348
H  -1.900878 -0.762001 2.058263
H  -3.048639 0.51081 -1.625341
H  -1.259392 3.75568 0.628311
H  0.884428 -0.043444 -1.383722
H  2.170377 -0.051383 2.705835
H  2.77714 -1.540086 -1.891178
elementType: Cl F O N C H
totalener: -1383.88041564 hartree
nucrepener: 1541.71184745 hartree
electener: -2925.59226309 hartree
oneelecener: -4959.97337908 hartree
twoeener: 2034.38111599 hartree
cpcmener: -0.06508528 hartree
kineticenergy: 1379.57343472 hartree
xcener: -105.387107032731 hartree
chargesum: 0.0000000
charge: -0.092129 -0.225710 -0.224865 -0.310598 -0.523780 -0.121771 -0.333602 0.017003 0.133372 -0.071945 0.072098 -0.059053 -0.365481 0.320940 0.394908 -0.094858 -0.010153 -0.163503 0.196827 0.129483 0.129201 0.133140 0.124004 0.130785 0.129905 0.147521 0.102965 0.150314 0.135746 0.149237
qa: -0.0921 -0.2257 -0.2249 -0.3106 -0.5238 -0.1218 -0.3336 0.0170 0.1334 -0.0719 0.0721 -0.0591 -0.3655 0.3209 0.3949 -0.0949 -0.0102 -0.1635 0.1968 0.1295 0.1292 0.1331 0.1240 0.1308 0.1299 0.1475 0.1030 0.1503 0.1357 0.1492
va: 1.2099 1.0519 1.0438 2.0650 1.9793 3.1612 3.0430 3.8049 3.8832 3.7843 3.9547 3.6309 3.7508 4.1385 4.3339 3.9233 4.0942 4.0001 4.1161 0.9933 0.9929 1.0013 1.0112 0.9968 0.9931 1.0171 0.9862 0.9990 1.0086 1.0044
dispcorr: -0.014725503 hartree
energy: -1383.895141141647
dipole: -3.84366 6.49490 2.65124 3.45867 -0.24336 3.21531 3.74803 -2.69281 1.05522
magnitude: 4.29893 au
magnitude: 10.92701 debye
