program: Orca
programVersion: 5.0.2
elementType: Cl F F O O N N C C C C C C C C C C C C H H H H H H H H H H H
charge: 0
multiplicity: 1
keywords: wb97x-d3
keywords: def2-TZVPP
keywords: def2/J RIJCOSX
keywords: DEFGRID2
keywords: scfconv7
keywords: smallprint printgap noloewdin
keywords: NOSOSCF
formula: C12H11ClF2N2O2
InChI: InChI=1/C12H11ClF2N2O2/c13-10-2-1-8(4-16-10)5-17(6-11(14)15)9-3-12(18)19-7-9/h1-4,11H,5-7H2
30 atoms
Cl 4.381996 -2.102376 -0.879927
F  -1.108979 4.315837 -0.567839
F  0.56203 3.011611 -0.043576
O  -3.639051 -0.933685 -1.109484
O  -3.175212 -3.080803 -0.728842
N  -1.320866 0.977591 0.854331
N  2.199755 -0.684834 -0.873623
C  -0.240527 0.580262 1.735483
C  -2.036661 0.025269 0.246114
C  -1.603317 2.384902 0.658844
C  -3.169392 0.332864 -0.687758
C  0.92071 -0.111395 1.067621
C  -1.915211 -1.325969 0.333641
C  -0.74895 3.011015 -0.419588
C  -2.917491 -1.917402 -0.502588
C  1.818093 -0.827809 1.853384
C  1.159959 -0.08562 -0.296858
C  2.901673 -1.454995 1.270497
C  3.032671 -1.337024 -0.103153
H  -0.63765 -0.077495 2.514237
H  0.118993 1.470171 2.251202
H  -2.650753 2.524545 0.393152
H  -1.449547 2.914214 1.601346
H  -3.977578 0.873507 -0.188845
H  -2.845136 0.915761 -1.553217
H  -1.208803 -1.904296 0.906459
H  -0.828774 2.511218 -1.385836
H  1.668878 -0.900223 2.923814
H  0.488754 0.418833 -0.979002
H  3.610876 -2.01707 1.860047
elementType: Cl F O N C H
totalener: -1383.88091295 hartree
nucrepener: 1571.16986006 hartree
electener: -2955.05077302 hartree
oneelecener: -5019.63086372 hartree
twoeener: 2064.58009070 hartree
cpcmener: -0.06444079 hartree
kineticenergy: 1379.58216927 hartree
xcener: -105.390016694382 hartree
chargesum: -0.0000000
charge: -0.092791 -0.223784 -0.222420 -0.307406 -0.520907 -0.114346 -0.336239 0.008375 0.141198 -0.075072 0.061126 -0.006365 -0.370490 0.318411 0.398306 -0.164324 0.034033 -0.156351 0.186990 0.133785 0.128354 0.116791 0.129165 0.125611 0.132572 0.154114 0.104683 0.149643 0.117043 0.150294
qa: -0.0928 -0.2238 -0.2224 -0.3074 -0.5209 -0.1143 -0.3362 0.0084 0.1412 -0.0751 0.0611 -0.0064 -0.3705 0.3184 0.3983 -0.1643 0.0340 -0.1564 0.1870 0.1338 0.1284 0.1168 0.1292 0.1256 0.1326 0.1541 0.1047 0.1496 0.1170 0.1503
va: 1.2097 1.0587 1.0412 2.0708 1.9842 3.1889 3.0702 3.7489 3.8547 3.7876 3.9779 3.5513 3.7019 4.0881 4.3379 4.0311 4.0051 3.9483 4.1211 0.9957 1.0030 1.0161 1.0141 0.9919 0.9913 1.0053 0.9852 1.0010 1.0233 1.0025
dispcorr: -0.015339123 hartree
energy: -1383.896252078052
dipole: -12.87524 12.79495 -0.08029 2.22334 1.28972 3.51306 9.60137 -6.55129 3.05008
magnitude: 4.65306 au
magnitude: 11.82715 debye
