program: Orca
programVersion: 5.0.2
elementType: Cl F F O O N N C C C C C C C C C C C C H H H H H H H H H H H
charge: 0
multiplicity: 1
keywords: wb97x-d3
keywords: def2-TZVPP
keywords: def2/J RIJCOSX
keywords: DEFGRID2
keywords: scfconv7
keywords: smallprint printgap noloewdin
keywords: NOSOSCF
formula: C12H11ClF2N2O2
InChI: InChI=1/C12H11ClF2N2O2/c13-10-2-1-8(4-16-10)5-17(6-11(14)15)9-3-12(18)19-7-9/h1-4,11H,5-7H2
30 atoms
Cl 4.592433 -2.312964 1.462015
F  -2.637688 3.174434 -0.9965
F  -1.110049 4.513814 -0.184785
O  -3.678033 -0.873685 0.798252
O  -3.596682 -2.920877 -0.079905
N  -0.870617 0.921912 -0.54191
N  2.302931 -1.087567 1.313092
C  0.220318 0.52237 -1.4032
C  -1.808343 0.026737 -0.212654
C  -0.7689 2.220788 0.088771
C  -2.922983 0.322692 0.747644
C  1.32577 -0.211068 -0.68907
C  -1.942965 -1.259944 -0.631297
C  -1.295323 3.317553 -0.806586
C  -3.103526 -1.815286 -0.001726
C  2.425648 -0.665011 -1.41233
C  1.321077 -0.45202 0.674626
C  3.45197 -1.32204 -0.764819
C  3.32224 -1.499669 0.604455
H  0.630922 1.41611 -1.876089
H  -0.166834 -0.090338 -2.219689
H  -1.295029 2.240262 1.044196
H  0.28072 2.427579 0.30723
H  -2.549544 0.56013 1.747032
H  -3.556948 1.144572 0.411345
H  -1.314186 -1.815565 -1.307959
H  -0.81639 3.353882 -1.786187
H  2.481271 -0.503261 -2.481953
H  0.499407 -0.127874 1.301492
H  4.317358 -1.681167 -1.30256
elementType: Cl F O N C H
totalener: -1383.88162911 hartree
nucrepener: 1540.58882088 hartree
electener: -2924.47044999 hartree
oneelecener: -4958.06931264 hartree
twoeener: 2033.59886264 hartree
cpcmener: -0.06402925 hartree
kineticenergy: 1379.58319367 hartree
xcener: -105.389534613897 hartree
chargesum: 0.0000000
charge: -0.092588 -0.225979 -0.224457 -0.308611 -0.522759 -0.127285 -0.333875 0.026595 0.118099 -0.070699 0.071938 -0.002741 -0.368752 0.318365 0.399135 -0.173423 0.026967 -0.152521 0.186772 0.135065 0.128769 0.123526 0.131819 0.126798 0.122843 0.152101 0.105048 0.152859 0.126135 0.150858
qa: -0.0926 -0.2260 -0.2245 -0.3086 -0.5228 -0.1273 -0.3339 0.0266 0.1181 -0.0707 0.0719 -0.0027 -0.3688 0.3184 0.3991 -0.1734 0.0270 -0.1525 0.1868 0.1351 0.1288 0.1235 0.1318 0.1268 0.1228 0.1521 0.1050 0.1529 0.1261 0.1509
va: 1.2096 1.0438 1.0533 2.0688 1.9812 3.1724 3.0547 3.7925 3.8911 3.8053 3.9586 3.6155 3.7165 4.1218 4.3335 4.0406 4.0050 3.9433 4.1249 0.9920 0.9928 1.0181 1.0052 0.9929 1.0060 1.0071 0.9860 0.9992 1.0152 1.0027
dispcorr: -0.014540165 hartree
energy: -1383.896169273348
dipole: -4.10139 6.70072 2.59933 2.46439 1.19985 3.66424 -6.62904 4.45963 -2.16941
magnitude: 4.98894 au
magnitude: 12.68089 debye
