program: Orca
programVersion: 5.0.2
elementType: Cl F F O O N N C C C C C C C C C C C C H H H H H H H H H H H
charge: 0
multiplicity: 1
keywords: wb97x-d3
keywords: def2-TZVPP
keywords: def2/J RIJCOSX
keywords: DEFGRID2
keywords: scfconv7
keywords: smallprint printgap noloewdin
keywords: NOSOSCF
formula: C12H11ClF2N2O2
InChI: InChI=1/C12H11ClF2N2O2/c13-10-2-1-8(4-16-10)5-17(6-11(14)15)9-3-12(18)19-7-9/h1-4,11H,5-7H2
30 atoms
Cl 4.442013 -2.610523 1.323384
F  -1.831029 4.469615 0.111485
F  -1.321202 3.436734 -1.748975
O  -3.629699 -1.044593 0.747789
O  -3.467144 -2.977654 -0.350148
N  -0.895591 0.999322 -0.361401
N  2.271487 -1.173818 1.323534
C  0.229574 0.729351 -1.230883
C  -1.793043 0.031186 -0.143111
C  -0.987759 2.289016 0.290066
C  -2.927408 0.180524 0.827993
C  1.295936 -0.128821 -0.597839
C  -1.863039 -1.212545 -0.686774
C  -1.844278 3.255845 -0.50228
C  -3.012426 -1.873241 -0.14126
C  2.326427 -0.638787 -1.383501
C  1.323759 -0.430622 0.753643
C  3.318218 -1.407287 -0.807329
C  3.224378 -1.637575 0.556694
H  0.669345 1.678572 -1.535622
H  -0.123763 0.255363 -2.15002
H  -1.403319 2.19004 1.294057
H  0.016088 2.698964 0.405989
H  -2.566337 0.33252 1.848555
H  -3.597514 1.00417 0.572394
H  -1.204499 -1.665153 -1.410261
H  -2.880059 2.933955 -0.613675
H  2.354764 -0.435749 -2.447185
H  0.557597 -0.06373 1.426085
H  4.129319 -1.812685 -1.395141
elementType: Cl F O N C H
totalener: -1383.88096423 hartree
nucrepener: 1540.50406789 hartree
electener: -2924.38503212 hartree
oneelecener: -4957.93230780 hartree
twoeener: 2033.54727568 hartree
cpcmener: -0.06326163 hartree
kineticenergy: 1379.56581795 hartree
xcener: -105.385893147369 hartree
chargesum: 0.0000000
charge: -0.093843 -0.223168 -0.226928 -0.309153 -0.520933 -0.120669 -0.334292 0.022133 0.122867 -0.092578 0.071918 -0.003608 -0.369215 0.334241 0.399582 -0.169723 0.028539 -0.154152 0.186611 0.124710 0.128272 0.122736 0.132453 0.128970 0.129305 0.153591 0.101977 0.151830 0.127769 0.150757
qa: -0.0938 -0.2232 -0.2269 -0.3092 -0.5209 -0.1207 -0.3343 0.0221 0.1229 -0.0926 0.0719 -0.0036 -0.3692 0.3342 0.3996 -0.1697 0.0285 -0.1542 0.1866 0.1247 0.1283 0.1227 0.1325 0.1290 0.1293 0.1536 0.1020 0.1518 0.1278 0.1508
va: 1.2081 1.0563 1.0426 2.0692 1.9835 3.1558 3.0512 3.7605 3.8842 3.8305 3.9646 3.6189 3.7136 4.1236 4.3352 4.0384 4.0070 3.9478 4.1257 1.0066 0.9927 1.0107 1.0096 0.9934 0.9919 1.0068 0.9845 1.0002 1.0174 1.0025
dispcorr: -0.014590722 hartree
energy: -1383.895554948364
dipole: -6.70664 8.05840 1.35176 3.09440 0.64810 3.74251 -3.87610 2.78908 -1.08702
magnitude: 4.12495 au
magnitude: 10.48479 debye
