program: Orca
programVersion: 5.0.2
elementType: Cl F F O O N N C C C C C C C C C C C C H H H H H H H H H H H
charge: 0
multiplicity: 1
keywords: wb97x-d3
keywords: def2-TZVPP
keywords: def2/J RIJCOSX
keywords: DEFGRID2
keywords: scfconv7
keywords: smallprint printgap noloewdin
keywords: NOSOSCF
formula: C12H11ClF2N2O2
InChI: InChI=1/C12H11ClF2N2O2/c13-10-2-1-8(4-16-10)5-17(6-11(14)15)9-3-12(18)19-7-9/h1-4,11H,5-7H2
30 atoms
Cl 4.645768 -2.573708 0.824889
F  -1.095966 3.972817 -0.493916
F  -2.960421 3.004086 0.079492
O  -2.74078 -1.798192 -0.892865
O  -4.474249 -1.889517 0.504577
N  -0.848481 1.123299 -0.034069
N  2.493322 -1.156669 1.191749
C  0.321374 1.130652 -0.892605
C  -1.74618 0.133263 -0.109019
C  -0.961971 2.134585 0.993566
C  -1.623552 -0.962456 -1.12739
C  1.406876 0.170458 -0.478953
C  -2.859122 -0.107318 0.63452
C  -1.729831 3.354462 0.546175
C  -3.472321 -1.305895 0.14608
C  2.36594 -0.228621 -1.405148
C  1.519822 -0.333382 0.806793
C  3.380608 -1.082917 -1.021683
C  3.384604 -1.504812 0.298319
H  0.726654 2.141657 -0.901741
H  0.027319 0.927874 -1.924169
H  -1.446839 1.724315 1.880741
H  0.033457 2.450276 1.309906
H  -1.657434 -0.579133 -2.150075
H  -0.703514 -1.53921 -1.004819
H  -3.265603 0.472106 1.447166
H  -1.851039 4.075079 1.355587
H  2.317796 0.12353 -2.428362
H  0.803077 -0.072611 1.57626
H  4.13351 -1.41286 -1.722786
elementType: Cl F O N C H
totalener: -1383.88053747 hartree
nucrepener: 1553.14246862 hartree
electener: -2937.02300609 hartree
oneelecener: -4983.53878896 hartree
twoeener: 2046.51578287 hartree
cpcmener: -0.06328033 hartree
kineticenergy: 1379.57637177 hartree
xcener: -105.388430252625 hartree
chargesum: -0.0000000
charge: -0.091997 -0.230493 -0.225676 -0.311255 -0.526696 -0.109395 -0.335406 0.018720 0.133361 -0.075800 0.073574 -0.048494 -0.371278 0.315279 0.397657 -0.153530 0.043466 -0.157017 0.188618 0.122056 0.128799 0.124460 0.134826 0.129703 0.131616 0.147824 0.118156 0.150546 0.127833 0.150544
qa: -0.0920 -0.2305 -0.2257 -0.3113 -0.5267 -0.1094 -0.3354 0.0187 0.1334 -0.0758 0.0736 -0.0485 -0.3713 0.3153 0.3977 -0.1535 0.0435 -0.1570 0.1886 0.1221 0.1288 0.1245 0.1348 0.1297 0.1316 0.1478 0.1182 0.1505 0.1278 0.1505
va: 1.2102 1.0417 1.0442 2.0643 1.9765 3.1546 3.0556 3.7727 3.8884 3.8179 3.9568 3.6355 3.7444 4.1237 4.3311 4.0241 4.0060 3.9529 4.1269 1.0053 0.9946 1.0028 1.0007 0.9937 0.9961 1.0161 0.9848 1.0010 1.0153 1.0028
dispcorr: -0.014825639 hartree
energy: -1383.895363104435
dipole: -3.25880 6.44936 3.19056 4.55876 -1.01137 3.54739 -3.36130 2.18735 -1.17396
magnitude: 4.91343 au
magnitude: 12.48895 debye
