program: Orca
programVersion: 5.0.2
elementType: Cl F F O O N N C C C C C C C C C C C C H H H H H H H H H H H
charge: 0
multiplicity: 1
keywords: wb97x-d3
keywords: def2-TZVPP
keywords: def2/J RIJCOSX
keywords: DEFGRID2
keywords: scfconv7
keywords: smallprint printgap noloewdin
keywords: NOSOSCF
formula: C12H11ClF2N2O2
InChI: InChI=1/C12H11ClF2N2O2/c13-10-2-1-8(4-16-10)5-17(6-11(14)15)9-3-12(18)19-7-9/h1-4,11H,5-7H2
30 atoms
Cl 4.366994 -2.97911 -0.468472
F  -1.378849 3.715863 1.156603
F  -1.926504 4.557266 -0.788392
O  -3.438127 -1.135734 -0.821933
O  -3.151587 -2.906979 0.501838
N  -0.839415 1.194499 0.011453
N  2.876358 -1.601217 1.161927
C  0.283807 1.109107 0.926178
C  -1.678356 0.157294 -0.075542
C  -1.023459 2.395917 -0.77357
C  -2.812188 0.111416 -1.057036
C  1.301016 0.08143 0.504732
C  -1.680383 -1.005735 0.628223
C  -1.902379 3.404896 -0.063482
C  -2.774175 -1.805793 0.162533
C  1.63858 -0.129158 -0.827798
C  1.952475 -0.689242 1.453973
C  2.590627 -1.077944 -1.14999
C  3.169693 -1.776745 -0.102754
H  -0.070113 0.886578 1.935542
H  0.757777 2.087868 0.976964
H  -0.048211 2.839105 -0.981678
H  -1.471883 2.161178 -1.740464
H  -3.5326 0.918155 -0.906607
H  -2.453916 0.154301 -2.088706
H  -1.006719 -1.321939 1.40817
H  -2.926994 3.063119 0.084367
H  1.161637 0.434787 -1.620052
H  1.714803 -0.57375 2.505907
H  2.870763 -1.268032 -2.176057
elementType: Cl F O N C H
totalener: -1383.88076357 hartree
nucrepener: 1545.28516750 hartree
electener: -2929.16593107 hartree
oneelecener: -4967.41793874 hartree
twoeener: 2038.25200767 hartree
cpcmener: -0.06460820 hartree
kineticenergy: 1379.57751289 hartree
xcener: -105.387109755940 hartree
chargesum: 0.0000000
charge: -0.092556 -0.226613 -0.224017 -0.308346 -0.520975 -0.119017 -0.334019 0.026406 0.147582 -0.099677 0.059432 -0.028774 -0.362114 0.336817 0.391272 -0.121440 -0.008044 -0.167241 0.196219 0.130233 0.119507 0.130933 0.122574 0.130382 0.129717 0.152909 0.102558 0.153172 0.134048 0.149072
qa: -0.0926 -0.2266 -0.2240 -0.3083 -0.5210 -0.1190 -0.3340 0.0264 0.1476 -0.0997 0.0594 -0.0288 -0.3621 0.3368 0.3913 -0.1214 -0.0080 -0.1672 0.1962 0.1302 0.1195 0.1309 0.1226 0.1304 0.1297 0.1529 0.1026 0.1532 0.1340 0.1491
va: 1.2097 1.0423 1.0553 2.0668 1.9833 3.1641 3.0444 3.7506 3.8770 3.8410 3.9691 3.6318 3.7091 4.1211 4.3426 3.9592 4.0726 3.9830 4.1193 0.9966 1.0050 1.0091 1.0092 0.9909 0.9913 1.0079 0.9845 1.0009 1.0115 1.0046
dispcorr: -0.014782393 hartree
energy: -1383.895545962303
dipole: -7.55278 8.13024 0.57746 5.07388 -0.74499 4.32889 -2.01780 0.34632 -1.67149
magnitude: 4.67618 au
magnitude: 11.88590 debye
