program: Orca
programVersion: 5.0.2
elementType: Cl F F O O N N C C C C C C C C C C C C H H H H H H H H H H H
charge: 0
multiplicity: 1
keywords: wb97x-d3
keywords: def2-TZVPP
keywords: def2/J RIJCOSX
keywords: DEFGRID2
keywords: scfconv7
keywords: smallprint printgap noloewdin
keywords: NOSOSCF
formula: C12H11ClF2N2O2
InChI: InChI=1/C12H11ClF2N2O2/c13-10-2-1-8(4-16-10)5-17(6-11(14)15)9-3-12(18)19-7-9/h1-4,11H,5-7H2
30 atoms
Cl 4.435973 -2.780907 -0.519832
F  -3.008156 3.112766 0.23722
F  -1.257853 3.761782 1.350912
O  -3.235528 -0.96318 -1.346442
O  -3.12097 -2.830393 -0.133863
N  -0.788837 1.287828 0.016043
N  2.694107 -0.900345 -0.970747
C  0.222031 1.108654 1.04324
C  -1.612911 0.271419 -0.261254
C  -0.884519 2.564758 -0.655187
C  -2.605751 0.304038 -1.386896
C  1.266227 0.08728 0.677537
C  -1.696181 -0.946317 0.337663
C  -1.733232 3.570509 0.087522
C  -2.708776 -1.707236 -0.333421
C  1.813924 -0.748555 1.642649
C  1.746301 -0.037113 -0.617264
C  2.802906 -1.649438 1.292702
C  3.195893 -1.669089 -0.034696
H  -0.245543 0.835473 1.992423
H  0.711256 2.067394 1.208443
H  0.114584 2.98494 -0.778355
H  -1.284044 2.450645 -1.663812
H  -3.354924 1.087597 -1.26974
H  -2.112837 0.439327 -2.352983
H  -1.133849 -1.323934 1.175945
H  -1.763221 4.532015 -0.425155
H  1.465422 -0.700839 2.66719
H  1.353872 0.580293 -1.417265
H  3.243199 -2.313425 2.022769
elementType: Cl F O N C H
totalener: -1383.88050494 hartree
nucrepener: 1561.32367230 hartree
electener: -2945.20417724 hartree
oneelecener: -5000.34995387 hartree
twoeener: 2055.14577664 hartree
cpcmener: -0.06267679 hartree
kineticenergy: 1379.58588267 hartree
xcener: -105.389580661036 hartree
chargesum: -0.0000000
charge: -0.092124 -0.227567 -0.228120 -0.308554 -0.522236 -0.110213 -0.335338 0.027773 0.132374 -0.086054 0.070061 -0.016891 -0.367348 0.319982 0.393593 -0.159938 0.014268 -0.155204 0.185566 0.131185 0.120547 0.129994 0.122886 0.123347 0.127713 0.153803 0.121406 0.151986 0.132039 0.151063
qa: -0.0921 -0.2276 -0.2281 -0.3086 -0.5222 -0.1102 -0.3353 0.0278 0.1324 -0.0861 0.0701 -0.0169 -0.3673 0.3200 0.3936 -0.1599 0.0143 -0.1552 0.1856 0.1312 0.1205 0.1300 0.1229 0.1233 0.1277 0.1538 0.1214 0.1520 0.1320 0.1511
va: 1.2103 1.0437 1.0451 2.0679 1.9820 3.1565 3.0513 3.7361 3.8941 3.8636 3.9548 3.6149 3.7094 4.0900 4.3407 4.0105 4.0396 3.9581 4.1298 0.9968 1.0030 1.0021 1.0066 1.0057 0.9912 1.0078 0.9852 1.0025 1.0152 1.0024
dispcorr: -0.014971110 hartree
energy: -1383.895476049666
dipole: -4.80217 6.34391 1.54174 7.25929 -2.44172 4.81757 0.35179 0.14887 0.50066
magnitude: 5.08297 au
magnitude: 12.91989 debye
