program: Orca
programVersion: 5.0.2
elementType: Cl F F O O N N C C C C C C C C C C C C H H H H H H H H H H H
charge: 0
multiplicity: 1
keywords: wb97x-d3
keywords: def2-TZVPP
keywords: def2/J RIJCOSX
keywords: DEFGRID2
keywords: scfconv7
keywords: smallprint printgap noloewdin
keywords: NOSOSCF
formula: C12H11ClF2N2O2
InChI: InChI=1/C12H11ClF2N2O2/c13-10-2-1-8(4-16-10)5-17(6-11(14)15)9-3-12(18)19-7-9/h1-4,11H,5-7H2
30 atoms
Cl 4.955457 -1.03714 -0.739009
F  -0.529199 1.586823 -1.506722
F  -0.322439 3.626272 -0.729034
O  -4.231908 -0.55843 -0.733433
O  -4.312127 -2.766975 -0.451132
N  -1.318323 0.606974 1.01381
N  3.37611 -0.07716 1.091116
C  -0.302816 -0.029072 1.836854
C  -2.286994 -0.115588 0.437311
C  -1.165557 2.017413 0.734907
C  -3.396169 0.51863 -0.355132
C  0.989664 -0.312499 1.120992
C  -2.521633 -1.455112 0.481618
C  -0.199974 2.310547 -0.398683
C  -3.729348 -1.724237 -0.239698
C  1.050772 -1.030091 -0.071442
C  2.187602 0.142831 1.648013
C  2.275997 -1.263439 -0.665299
C  3.398756 -0.758929 -0.026635
H  -0.714763 -0.949276 2.251539
H  -0.106968 0.624128 2.689006
H  -2.132635 2.465648 0.501942
H  -0.799491 2.516713 1.633466
H  -3.966351 1.229718 0.248197
H  -3.037964 1.032575 -1.247937
H  -1.929917 -2.227164 0.946477
H  0.844688 2.111077 -0.162431
H  0.153252 -1.414114 -0.539361
H  2.193836 0.715533 2.568521
H  2.355293 -1.81831 -1.588863
elementType: Cl F O N C H
totalener: -1383.88058548 hartree
nucrepener: 1573.53618014 hartree
electener: -2957.41676561 hartree
oneelecener: -5023.74427129 hartree
twoeener: 2066.32750568 hartree
cpcmener: -0.05848889 hartree
kineticenergy: 1379.57100402 hartree
xcener: -105.386831385513 hartree
chargesum: -0.0000000
charge: -0.089481 -0.227129 -0.222849 -0.308130 -0.522851 -0.104658 -0.328174 0.026437 0.148766 -0.094655 0.056284 -0.084763 -0.379348 0.333462 0.392314 -0.108170 0.001029 -0.154860 0.193894 0.127517 0.128721 0.120588 0.128700 0.126564 0.123896 0.153473 0.111226 0.168002 0.134454 0.149741
qa: -0.0895 -0.2271 -0.2228 -0.3081 -0.5229 -0.1047 -0.3282 0.0264 0.1488 -0.0947 0.0563 -0.0848 -0.3793 0.3335 0.3923 -0.1082 0.0010 -0.1549 0.1939 0.1275 0.1287 0.1206 0.1287 0.1266 0.1239 0.1535 0.1112 0.1680 0.1345 0.1497
va: 1.2130 1.0416 1.0583 2.0672 1.9821 3.2007 3.0402 3.7728 3.8635 3.8478 3.9680 3.6717 3.6949 4.0823 4.3393 3.9182 4.0638 3.9940 4.1291 0.9972 0.9971 1.0144 1.0087 0.9906 1.0082 1.0069 0.9775 0.9909 1.0121 1.0045
dispcorr: -0.015548453 hartree
energy: -1383.896133931902
dipole: -12.67671 13.74133 1.06462 0.52742 2.12209 2.64951 9.82480 -7.73092 2.09389
magnitude: 3.54087 au
magnitude: 9.00017 debye
