program: Orca
programVersion: 5.0.2
elementType: Cl F F O O N N C C C C C C C C C C C C H H H H H H H H H H H
charge: 0
multiplicity: 1
keywords: wb97x-d3
keywords: def2-TZVPP
keywords: def2/J RIJCOSX
keywords: DEFGRID2
keywords: scfconv7
keywords: smallprint printgap noloewdin
keywords: NOSOSCF
formula: C12H11ClF2N2O2
InChI: InChI=1/C12H11ClF2N2O2/c13-10-2-1-8(4-16-10)5-17(6-11(14)15)9-3-12(18)19-7-9/h1-4,11H,5-7H2
30 atoms
Cl 4.658345 -2.487674 1.373081
F  -2.663717 3.19616 -0.903691
F  -1.372885 4.522925 0.261138
O  -3.760645 -0.990712 0.267298
O  -3.481522 -2.910695 -0.826306
N  -0.842913 0.999203 -0.404787
N  3.565239 -1.084428 -0.526116
C  0.356031 0.740767 -1.170022
C  -1.79251 0.054662 -0.336011
C  -0.905154 2.230729 0.352397
C  -3.047851 0.210757 0.475174
C  1.391913 -0.078136 -0.438295
C  -1.820536 -1.171231 -0.917142
C  -1.377912 3.392217 -0.496365
C  -3.047443 -1.820058 -0.54035
C  1.224318 -0.569642 0.849434
C  2.592628 -0.368785 -1.074588
C  2.231245 -1.319761 1.434357
C  3.374304 -1.543237 0.687263
H  0.793733 1.696846 -1.463097
H  0.087136 0.243193 -2.104836
H  -1.553812 2.124408 1.223334
H  0.091247 2.464754 0.733512
H  -2.833196 0.327965 1.541368
H  -3.653483 1.05849 0.150962
H  -1.081495 -1.634737 -1.550689
H  -0.765111 3.563886 -1.38234
H  0.319535 -0.379162 1.412515
H  2.77969 -0.005114 -2.079973
H  2.123665 -1.715528 2.434143
elementType: Cl F O N C H
totalener: -1383.88227477 hartree
nucrepener: 1536.54491520 hartree
electener: -2920.42718996 hartree
oneelecener: -4949.84668272 hartree
twoeener: 2029.41949275 hartree
cpcmener: -0.05125443 hartree
kineticenergy: 1379.57129527 hartree
xcener: -105.385709361577 hartree
chargesum: 0.0000000
charge: -0.089157 -0.222615 -0.220887 -0.296457 -0.478917 -0.123991 -0.325400 0.007947 0.108300 -0.081280 0.067322 -0.011129 -0.359893 0.323728 0.375775 -0.120958 -0.019332 -0.164608 0.197277 0.132791 0.128307 0.119588 0.130191 0.120927 0.120350 0.148976 0.100940 0.150037 0.134617 0.147554
qa: -0.0892 -0.2226 -0.2209 -0.2965 -0.4789 -0.1240 -0.3254 0.0079 0.1083 -0.0813 0.0673 -0.0111 -0.3599 0.3237 0.3758 -0.1210 -0.0193 -0.1646 0.1973 0.1328 0.1283 0.1196 0.1302 0.1209 0.1203 0.1490 0.1009 0.1500 0.1346 0.1476
va: 1.2123 1.0486 1.0584 2.0800 2.0371 3.1459 3.0468 3.8167 3.8786 3.8244 3.9659 3.6194 3.7127 4.1172 4.3656 3.9426 4.1049 3.9991 4.1184 0.9922 0.9923 1.0184 1.0054 0.9919 1.0058 1.0081 0.9863 0.9995 1.0071 1.0048
dispcorr: -0.014547964 hartree
energy: -1383.896822728889
dipole: -5.99755 7.29859 1.30104 3.40137 0.22333 3.62470 -2.26148 2.81190 0.55042
magnitude: 3.89026 au
magnitude: 9.88825 debye
