program: Orca
programVersion: 5.0.2
elementType: Cl F F O O N N C C C C C C C C C C C C H H H H H H H H H H H
charge: 0
multiplicity: 1
keywords: wb97x-d3
keywords: def2-TZVPP
keywords: def2/J RIJCOSX
keywords: DEFGRID2
keywords: scfconv7
keywords: smallprint printgap noloewdin
keywords: NOSOSCF
formula: C12H11ClF2N2O2
InChI: InChI=1/C12H11ClF2N2O2/c13-10-2-1-8(4-16-10)5-17(6-11(14)15)9-3-12(18)19-7-9/h1-4,11H,5-7H2
30 atoms
Cl 4.954422 -2.099568 -0.54226
F  -0.724915 4.173823 -0.748918
F  -2.490932 3.172539 0.070011
O  -3.850641 -0.916099 -1.064678
O  -4.250882 -2.693072 0.216425
N  -0.959032 0.718131 0.305176
N  2.375493 -1.866711 -0.304018
C  -0.056199 0.441613 1.409927
C  -1.992501 -0.091181 0.037099
C  -0.620582 1.851262 -0.52561
C  -2.904919 0.130247 -1.137769
C  1.24029 -0.174262 0.951428
C  -2.412206 -1.212722 0.678871
C  -1.128144 3.152479 0.055397
C  -3.566905 -1.722122 -0.0077
C  2.467743 0.364603 1.316442
C  1.259402 -1.298887 0.13495
C  3.640446 -0.219965 0.869771
C  3.517685 -1.334588 0.058164
H  -0.558078 -0.203649 2.130069
H  0.153376 1.371742 1.941305
H  0.466676 1.915445 -0.613473
H  -1.002049 1.729851 -1.540665
H  -3.418326 1.091888 -1.094678
H  -2.365069 0.068576 -2.086869
H  -1.992534 -1.691556 1.54884
H  -0.777495 3.34918 1.070278
H  2.513873 1.244366 1.947046
H  0.335539 -1.769465 -0.183678
H  4.607149 0.181972 1.137706
elementType: Cl F O N C H
totalener: -1383.88130548 hartree
nucrepener: 1535.86031745 hartree
electener: -2919.74162293 hartree
oneelecener: -4948.52610824 hartree
twoeener: 2028.78448531 hartree
cpcmener: -0.05074599 hartree
kineticenergy: 1379.58010136 hartree
xcener: -105.386490293192 hartree
chargesum: -0.0000000
charge: -0.086341 -0.221572 -0.222411 -0.296897 -0.481409 -0.113917 -0.324681 0.005677 0.135029 -0.081158 0.050921 -0.034544 -0.370693 0.322037 0.376689 -0.156048 0.028615 -0.143865 0.182538 0.129646 0.128708 0.126111 0.122845 0.121678 0.122265 0.145312 0.099158 0.148851 0.138226 0.149229
qa: -0.0863 -0.2216 -0.2224 -0.2969 -0.4814 -0.1139 -0.3247 0.0057 0.1350 -0.0812 0.0509 -0.0345 -0.3707 0.3220 0.3767 -0.1560 0.0286 -0.1439 0.1825 0.1296 0.1287 0.1261 0.1228 0.1217 0.1223 0.1453 0.0992 0.1489 0.1382 0.1492
va: 1.2155 1.0577 1.0495 2.0771 2.0353 3.1809 3.0586 3.7886 3.8698 3.8144 3.9733 3.6401 3.6969 4.1124 4.3595 4.0002 4.0202 3.9501 4.1335 0.9978 0.9931 1.0117 1.0173 1.0064 0.9909 1.0104 0.9861 1.0029 1.0081 1.0030
dispcorr: -0.014482164 hartree
energy: -1383.895787648334
dipole: -5.59522 8.37775 2.78254 2.85692 0.84624 3.70315 5.21928 -3.89635 1.32292
magnitude: 4.81726 au
magnitude: 12.24450 debye
