program: Orca
programVersion: 5.0.2
elementType: Cl F F O O N N C C C C C C C C C C C C H H H H H H H H H H H
charge: 0
multiplicity: 1
keywords: wb97x-d3
keywords: def2-TZVPP
keywords: def2/J RIJCOSX
keywords: DEFGRID2
keywords: scfconv7
keywords: smallprint printgap noloewdin
keywords: NOSOSCF
formula: C12H11ClF2N2O2
InChI: InChI=1/C12H11ClF2N2O2/c13-10-2-1-8(4-16-10)5-17(6-11(14)15)9-3-12(18)19-7-9/h1-4,11H,5-7H2
30 atoms
Cl 4.687115 -2.541406 -0.502346
F  -2.844597 3.186221 0.004087
F  -1.058277 3.757619 1.105377
O  -3.506562 -1.002873 -1.236208
O  -3.575125 -2.816506 0.052775
N  -0.885794 1.081781 0.070573
N  2.452987 -1.274609 -0.911085
C  0.086485 0.868713 1.121282
C  -1.787697 0.122489 -0.183388
C  -0.782102 2.282395 -0.72807
C  -2.758748 0.192002 -1.327514
C  1.239424 -0.018866 0.724828
C  -1.983904 -1.056256 0.459855
C  -1.519545 3.465696 -0.144045
C  -3.061505 -1.750605 -0.191969
C  2.20724 -0.345576 1.671924
C  1.417264 -0.517101 -0.555809
C  3.28729 -1.128188 1.316595
C  3.346436 -1.559409 -0.000807
H  -0.412521 0.457596 2.002253
H  0.481606 1.834591 1.43265
H  0.269124 2.555877 -0.839943
H  -1.151582 2.116938 -1.741312
H  -3.430559 1.049184 -1.262292
H  -2.24487 0.22898 -2.292436
H  -1.459011 -1.453753 1.313524
H  -1.416364 4.353918 -0.769321
H  2.119299 0.01503 2.690111
H  0.706238 -0.304961 -1.34547
H  4.05171 -1.391866 2.033442
elementType: Cl F O N C H
totalener: -1383.88236177 hartree
nucrepener: 1552.22576470 hartree
electener: -2936.10812647 hartree
oneelecener: -4982.01954626 hartree
twoeener: 2045.91141979 hartree
cpcmener: -0.05086019 hartree
kineticenergy: 1379.58328374 hartree
xcener: -105.388592740123 hartree
chargesum: 0.0000000
charge: -0.089572 -0.223860 -0.225778 -0.296725 -0.479730 -0.112986 -0.326053 0.009175 0.101454 -0.087169 0.072122 0.000935 -0.360613 0.320032 0.376411 -0.170321 0.027191 -0.155185 0.187892 0.126623 0.126929 0.132309 0.120268 0.120836 0.120763 0.147809 0.115998 0.149278 0.123636 0.148331
qa: -0.0896 -0.2239 -0.2258 -0.2967 -0.4797 -0.1130 -0.3261 0.0092 0.1015 -0.0872 0.0721 0.0009 -0.3606 0.3200 0.3764 -0.1703 0.0272 -0.1552 0.1879 0.1266 0.1269 0.1323 0.1203 0.1208 0.1208 0.1478 0.1160 0.1493 0.1236 0.1483
va: 1.2119 1.0485 1.0475 2.0808 2.0361 3.1344 3.0591 3.7757 3.8912 3.8663 3.9599 3.6047 3.7129 4.0966 4.3667 4.0374 4.0133 3.9509 4.1275 0.9931 1.0070 1.0024 1.0081 1.0046 0.9923 1.0085 0.9855 1.0006 1.0163 1.0036
dispcorr: -0.014708943 hartree
energy: -1383.897070710720
dipole: -4.96658 6.98599 2.01941 5.93994 -1.53898 4.40096 0.77557 -0.40141 0.37416
magnitude: 4.85659 au
magnitude: 12.34446 debye
