program: Orca
programVersion: 5.0.2
elementType: Cl F F O O N N C C C C C C C C C C C C H H H H H H H H H H H
charge: 0
multiplicity: 1
keywords: wb97x-d3
keywords: def2-TZVPP
keywords: def2/J RIJCOSX
keywords: DEFGRID2
keywords: scfconv7
keywords: smallprint printgap noloewdin
keywords: NOSOSCF
formula: C12H11ClF2N2O2
InChI: InChI=1/C12H11ClF2N2O2/c13-10-2-1-8(4-16-10)5-17(6-11(14)15)9-3-12(18)19-7-9/h1-4,11H,5-7H2
30 atoms
Cl 4.326515 -2.968061 1.194539
F  -2.707878 3.095705 -1.052894
F  -1.859968 4.640545 0.246088
O  -3.474326 -1.068452 0.180231
O  -2.969931 -2.853934 -1.049304
N  -0.729249 1.223572 -0.171954
N  3.215236 -1.499696 -0.639877
C  0.535632 1.119069 -0.871556
C  -1.595614 0.203467 -0.24498
C  -1.045344 2.46063 0.504054
C  -2.896376 0.17873 0.506562
C  1.456102 0.083679 -0.277556
C  -1.478978 -0.968208 -0.919287
C  -1.556177 3.514574 -0.45649
C  -2.651686 -1.75773 -0.653363
C  1.466847 -0.224268 1.078352
C  2.353042 -0.594505 -1.088762
C  2.353063 -1.170467 1.559034
C  3.20204 -1.769111 0.641038
H  1.020325 2.096134 -0.836181
H  0.367183 0.901087 -1.930262
H  -1.78256 2.295382 1.29196
H  -0.146986 2.844072 0.990892
H  -2.740116 0.239771 1.587472
H  -3.572825 0.982521 0.210682
H  -0.676636 -1.303966 -1.556474
H  -0.843061 3.77393 -1.241632
H  0.784147 0.259987 1.765586
H  2.377911 -0.40322 -2.156401
H  2.378941 -1.433097 2.606951
elementType: Cl F O N C H
totalener: -1383.88224043 hartree
nucrepener: 1545.87716635 hartree
electener: -2929.75940678 hartree
oneelecener: -4968.85545936 hartree
twoeener: 2039.09605258 hartree
cpcmener: -0.05247602 hartree
kineticenergy: 1379.58602680 hartree
xcener: -105.387732899494 hartree
chargesum: -0.0000000
charge: -0.088125 -0.223487 -0.220919 -0.295724 -0.478474 -0.119766 -0.325482 0.009808 0.123858 -0.100751 0.071419 -0.024380 -0.352799 0.333302 0.370897 -0.116977 -0.012735 -0.168254 0.197383 0.123098 0.130570 0.119805 0.127964 0.121599 0.118588 0.149022 0.104039 0.147543 0.130732 0.148247
qa: -0.0881 -0.2235 -0.2209 -0.2957 -0.4785 -0.1198 -0.3255 0.0098 0.1239 -0.1008 0.0714 -0.0244 -0.3528 0.3333 0.3709 -0.1170 -0.0127 -0.1683 0.1974 0.1231 0.1306 0.1198 0.1280 0.1216 0.1186 0.1490 0.1040 0.1475 0.1307 0.1482
va: 1.2134 1.0492 1.0584 2.0802 2.0375 3.1342 3.0492 3.7693 3.8759 3.8556 3.9603 3.6043 3.7059 4.1044 4.3712 3.9528 4.0886 3.9894 4.1197 0.9935 0.9946 1.0162 1.0038 0.9907 1.0057 1.0091 0.9849 1.0045 1.0111 1.0047
dispcorr: -0.014763972 hartree
energy: -1383.897004401602
dipole: -4.24501 5.59428 1.34927 6.41525 -2.02484 4.39041 -0.18103 1.46752 1.28650
magnitude: 4.76983 au
magnitude: 12.12395 debye
