program: Orca
programVersion: 5.0.2
elementType: Cl F F O O N N C C C C C C C C C C C C H H H H H H H H H H H
charge: 0
multiplicity: 1
keywords: wb97x-d3
keywords: def2-TZVPP
keywords: def2/J RIJCOSX
keywords: DEFGRID2
keywords: scfconv7
keywords: smallprint printgap noloewdin
keywords: NOSOSCF
formula: C12H11ClF2N2O2
InChI: InChI=1/C12H11ClF2N2O2/c13-10-2-1-8(4-16-10)5-17(6-11(14)15)9-3-12(18)19-7-9/h1-4,11H,5-7H2
30 atoms
Cl 4.943299 -1.224322 1.048858
F  -0.767467 3.754058 0.99743
F  -1.04633 1.699897 1.699171
O  -3.336899 -2.088765 -0.671074
O  -5.046518 -1.451931 0.604754
N  -1.178735 0.759498 -1.0261
N  3.569098 -0.218007 -0.916601
C  -0.02995 0.347919 -1.808825
C  -2.152302 -0.104787 -0.698257
C  -1.264532 2.143816 -0.617327
C  -2.169938 -1.515341 -1.219859
C  1.180427 -0.048919 -0.999961
C  -3.261862 0.06998 0.06279
C  -0.544076 2.448139 0.679258
C  -4.002679 -1.162761 0.068956
C  1.102982 -0.640068 0.256836
C  2.448444 0.138807 -1.532512
C  2.262223 -1.013935 0.911885
C  3.463101 -0.775628 0.263749
H  0.236407 1.167908 -2.477643
H  -0.30982 -0.477306 -2.466198
H  -0.825024 2.765478 -1.39933
H  -2.31242 2.437139 -0.527404
H  -2.233043 -1.540545 -2.311473
H  -1.294923 -2.093525 -0.912287
H  -3.579543 0.944698 0.606079
H  0.532652 2.285486 0.636342
H  0.15002 -0.816107 0.740335
H  2.569232 0.607734 -2.504081
H  2.229172 -1.472913 1.889818
elementType: Cl F O N C H
totalener: -1383.88126179 hartree
nucrepener: 1561.63337955 hartree
electener: -2945.51464134 hartree
oneelecener: -4999.93018249 hartree
twoeener: 2054.41554115 hartree
cpcmener: -0.05075086 hartree
kineticenergy: 1379.57530171 hartree
xcener: -105.386266867731 hartree
chargesum: 0.0000000
charge: -0.086819 -0.221943 -0.220486 -0.297221 -0.480728 -0.104499 -0.324839 -0.008762 0.123824 -0.068928 0.064603 0.000145 -0.369631 0.314512 0.373066 -0.142918 -0.013689 -0.167642 0.197087 0.123971 0.125166 0.123835 0.120120 0.123100 0.127378 0.144591 0.109121 0.157226 0.131526 0.148833
qa: -0.0868 -0.2219 -0.2205 -0.2972 -0.4807 -0.1045 -0.3248 -0.0088 0.1238 -0.0689 0.0646 0.0001 -0.3696 0.3145 0.3731 -0.1429 -0.0137 -0.1676 0.1971 0.1240 0.1252 0.1238 0.1201 0.1231 0.1274 0.1446 0.1091 0.1572 0.1315 0.1488
va: 1.2149 1.0601 1.0440 2.0754 2.0344 3.1798 3.0501 3.8346 3.8525 3.7778 3.9736 3.5579 3.7590 4.1119 4.3659 3.9457 4.0945 4.0158 4.1259 0.9999 0.9946 1.0114 1.0122 0.9930 0.9917 1.0189 0.9747 0.9973 1.0089 1.0049
dispcorr: -0.015246281 hartree
energy: -1383.896508073491
dipole: -9.59414 11.55945 1.96531 -0.22503 1.70695 1.48192 -11.99753 9.58600 -2.41153
magnitude: 3.44587 au
magnitude: 8.75870 debye
