program: Orca
programVersion: 5.0.2
elementType: Cl F F O O N N C C C C C C C C C C C C H H H H H H H H H H H
charge: 0
multiplicity: 1
keywords: wb97x-d3
keywords: def2-TZVPP
keywords: def2/J RIJCOSX
keywords: DEFGRID2
keywords: scfconv7
keywords: smallprint printgap noloewdin
keywords: NOSOSCF
formula: C12H11ClF2N2O2
InChI: InChI=1/C12H11ClF2N2O2/c13-10-2-1-8(4-16-10)5-17(6-11(14)15)9-3-12(18)19-7-9/h1-4,11H,5-7H2
30 atoms
Cl 4.907619 -1.964337 1.346453
F  -0.418208 3.556098 -1.090752
F  -2.425404 3.213649 -0.327322
O  -4.005011 -0.821096 0.590212
O  -4.246211 -2.570559 -0.76573
N  -0.914405 0.777472 -0.315878
N  3.61913 -0.106927 0.063966
C  0.150165 0.461221 -1.259832
C  -1.9924 -0.013268 -0.216543
C  -0.686551 1.888256 0.58181
C  -3.068193 0.212596 0.810658
C  1.318611 -0.211215 -0.594681
C  -2.335467 -1.117238 -0.932188
C  -1.113732 3.231942 0.036411
C  -3.585424 -1.615851 -0.429139
C  1.218307 -1.475306 -0.016385
C  2.548109 0.42381 -0.518693
C  2.321344 -2.038311 0.594592
C  3.493659 -1.294728 0.596421
H  0.48434 1.377573 -1.7437
H  -0.254312 -0.16615 -2.05219
H  -1.194092 1.735833 1.535182
H  0.376643 1.946945 0.827875
H  -2.680543 0.138139 1.830472
H  -3.559325 1.180177 0.697688
H  -1.804169 -1.591839 -1.741046
H  -0.964891 4.023646 0.772617
H  0.285297 -2.024639 -0.044094
H  2.680464 1.410405 -0.950403
H  2.27407 -3.017882 1.048482
elementType: Cl F O N C H
totalener: -1383.88166030 hartree
nucrepener: 1546.39032679 hartree
electener: -2930.27198709 hartree
oneelecener: -4969.83640874 hartree
twoeener: 2039.56442165 hartree
cpcmener: -0.04761977 hartree
kineticenergy: 1379.58305101 hartree
xcener: -105.387177422942 hartree
chargesum: -0.0000000
charge: -0.086095 -0.225564 -0.223068 -0.296617 -0.482787 -0.097326 -0.323220 -0.022212 0.149451 -0.080850 0.049209 -0.039818 -0.390734 0.317827 0.379236 -0.119763 0.003469 -0.172805 0.197615 0.131596 0.133275 0.120697 0.124551 0.123200 0.122708 0.144004 0.112561 0.169053 0.134151 0.148258
qa: -0.0861 -0.2256 -0.2231 -0.2966 -0.4828 -0.0973 -0.3232 -0.0222 0.1495 -0.0808 0.0492 -0.0398 -0.3907 0.3178 0.3792 -0.1198 0.0035 -0.1728 0.1976 0.1316 0.1333 0.1207 0.1246 0.1232 0.1227 0.1440 0.1126 0.1691 0.1342 0.1483
va: 1.2157 1.0459 1.0487 2.0760 2.0337 3.1731 3.0458 3.7984 3.8488 3.8559 3.9738 3.6342 3.6904 4.0888 4.3605 3.9596 4.0505 3.9956 4.1247 1.0136 0.9986 1.0090 1.0106 0.9910 1.0046 1.0107 0.9850 0.9874 1.0103 1.0058
dispcorr: -0.014688076 hartree
energy: -1383.896348378728
dipole: -8.16283 9.72582 1.56299 1.00618 1.48850 2.49468 -0.28927 1.38400 1.09473
magnitude: 3.14083 au
magnitude: 7.98335 debye
