program: Orca
programVersion: 5.0.2
elementType: Cl F F O O N N C C C C C C C C C C C C H H H H H H H H H H H
charge: 0
multiplicity: 1
keywords: wb97x-d3
keywords: def2-TZVPP
keywords: def2/J RIJCOSX
keywords: DEFGRID2
keywords: scfconv7
keywords: smallprint printgap noloewdin
keywords: NOSOSCF
formula: C12H11ClF2N2O2
InChI: InChI=1/C12H11ClF2N2O2/c13-10-2-1-8(4-16-10)5-17(6-11(14)15)9-3-12(18)19-7-9/h1-4,11H,5-7H2
30 atoms
Cl 4.874841 -1.052468 -0.85051
F  0.837046 2.450862 -0.123629
F  -0.751723 1.923128 -1.519011
O  -4.27654 -0.593511 -0.70485
O  -4.214508 -2.8038 -0.446209
N  -1.368332 0.723036 0.948573
N  3.339322 -0.199635 1.066925
C  -0.330584 0.124499 1.769474
C  -2.325554 -0.045969 0.408333
C  -1.352713 2.155488 0.75435
C  -3.496898 0.526582 -0.342459
C  0.943749 -0.209457 1.040944
C  -2.478219 -1.394962 0.445288
C  -0.485078 2.634528 -0.387992
C  -3.694322 -1.732175 -0.243515
C  0.967905 -0.786686 -0.224595
C  2.166562 0.061762 1.634843
C  2.179961 -1.060915 -0.829686
C  3.329841 -0.737735 -0.12579
H  -0.737755 -0.772631 2.24022
H  -0.108313 0.812802 2.58682
H  -2.362851 2.528074 0.579083
H  -1.014403 2.644479 1.670044
H  -4.092157 1.197375 0.283314
H  -3.196921 1.069317 -1.24066
H  -1.826195 -2.136847 0.878678
H  -0.649224 3.693932 -0.592024
H  0.051426 -1.025926 -0.749072
H  2.207657 0.523113 2.616367
H  2.227816 -1.505484 -1.813592
elementType: Cl F O N C H
totalener: -1383.88026858 hartree
nucrepener: 1590.89276981 hartree
electener: -2974.77303839 hartree
oneelecener: -5059.59570691 hartree
twoeener: 2084.82266852 hartree
cpcmener: -0.04943405 hartree
kineticenergy: 1379.59238408 hartree
xcener: -105.389773899951 hartree
chargesum: -0.0000000
charge: -0.089848 -0.221158 -0.230107 -0.295638 -0.479351 -0.097097 -0.325025 0.017530 0.134428 -0.099151 0.044218 -0.022508 -0.372148 0.325794 0.368478 -0.123976 -0.017804 -0.163035 0.193919 0.122816 0.126483 0.121800 0.120275 0.120132 0.122433 0.151960 0.130386 0.159808 0.129357 0.147032
qa: -0.0898 -0.2212 -0.2301 -0.2956 -0.4794 -0.0971 -0.3250 0.0175 0.1344 -0.0992 0.0442 -0.0225 -0.3721 0.3258 0.3685 -0.1240 -0.0178 -0.1630 0.1939 0.1228 0.1265 0.1218 0.1203 0.1201 0.1224 0.1520 0.1304 0.1598 0.1294 0.1470
va: 1.2117 1.0537 1.0455 2.0791 2.0373 3.1880 3.0483 3.7814 3.8643 3.9221 3.9858 3.5967 3.6972 4.0304 4.3712 3.9337 4.0997 4.0112 4.1271 0.9975 0.9946 1.0049 1.0135 0.9894 1.0034 1.0073 0.9841 0.9968 1.0112 1.0055
dispcorr: -0.015592203 hartree
energy: -1383.895860782812
dipole: -15.69198 15.49071 -0.20126 3.89985 -0.16503 3.73482 8.67279 -7.06266 1.61013
magnitude: 4.07209 au
magnitude: 10.35043 debye
