program: Orca
programVersion: 5.0.2
elementType: Cl F F O O N N C C C C C C C C C C C C H H H H H H H H H H H
charge: 0
multiplicity: 1
keywords: wb97x-d3
keywords: def2-TZVPP
keywords: def2/J RIJCOSX
keywords: DEFGRID2
keywords: scfconv7
keywords: smallprint printgap noloewdin
keywords: NOSOSCF
formula: C12H11ClF2N2O2
InChI: InChI=1/C12H11ClF2N2O2/c13-10-2-1-8(4-16-10)5-17(6-11(14)15)9-3-12(18)19-7-9/h1-4,11H,5-7H2
30 atoms
Cl 4.973676 -1.0587 -0.723651
F  -0.53925 1.656026 -1.527911
F  -0.333692 3.672435 -0.693341
O  -4.239507 -0.571672 -0.722978
O  -4.329562 -2.77283 -0.408686
N  -1.30096 0.60327 0.978559
N  3.388628 -0.114633 1.107347
C  -0.29711 -0.02205 1.821474
C  -2.286875 -0.122444 0.430957
C  -1.175376 2.020094 0.724728
C  -3.40037 0.505096 -0.362802
C  1.001147 -0.316255 1.118969
C  -2.527312 -1.457881 0.494271
C  -0.21109 2.348082 -0.400564
C  -3.744956 -1.732524 -0.218446
C  1.062511 -1.023789 -0.07996
C  2.202004 0.115581 1.660919
C  2.288338 -1.26757 -0.668356
C  3.413663 -0.782509 -0.017226
H  -0.714426 -0.937417 2.242743
H  -0.107608 0.639655 2.669176
H  -2.1490 2.455215 0.493377
H  -0.822133 2.514142 1.63218
H  -3.967078 1.22575 0.233649
H  -3.043936 1.007822 -1.263567
H  -1.938366 -2.229151 0.964181
H  0.834284 2.142175 -0.169622
H  0.163395 -1.391894 -0.558143
H  2.211781 0.677325 2.589035
H  2.366036 -1.813991 -1.597372
elementType: Cl F O N C H
totalener: -1383.88149915 hartree
nucrepener: 1569.67217279 hartree
electener: -2953.55367193 hartree
oneelecener: -5016.15394937 hartree
twoeener: 2062.60027744 hartree
cpcmener: -0.04772229 hartree
kineticenergy: 1379.57811595 hartree
xcener: -105.386557327539 hartree
chargesum: 0.0000000
charge: -0.085686 -0.224556 -0.220260 -0.295454 -0.480097 -0.104040 -0.320167 0.014556 0.146227 -0.098977 0.048268 -0.077290 -0.374642 0.334390 0.369888 -0.108246 -0.003043 -0.156598 0.194832 0.126202 0.126747 0.118832 0.125287 0.121280 0.121874 0.148778 0.106723 0.165297 0.131455 0.148420
qa: -0.0857 -0.2246 -0.2203 -0.2955 -0.4801 -0.1040 -0.3202 0.0146 0.1462 -0.0990 0.0483 -0.0773 -0.3746 0.3344 0.3699 -0.1082 -0.0030 -0.1566 0.1948 0.1262 0.1267 0.1188 0.1253 0.1213 0.1219 0.1488 0.1067 0.1653 0.1315 0.1484
va: 1.2160 1.0447 1.0619 2.0783 2.0365 3.1803 3.0452 3.7800 3.8525 3.8480 3.9784 3.6562 3.6943 4.0865 4.3705 3.9200 4.0692 3.9992 4.1293 0.9977 0.9973 1.0162 1.0099 0.9898 1.0067 1.0089 0.9787 0.9928 1.0117 1.0052
dispcorr: -0.015430873 hartree
energy: -1383.896930018494
dipole: -12.71907 13.68106 0.96199 0.44918 2.00687 2.45605 9.69705 -7.77807 1.91898
magnitude: 3.26192 au
magnitude: 8.29113 debye
