program: Orca
programVersion: 5.0.2
elementType: Cl F F O O N N C C C C C C C C C C C C H H H H H H H H H H H
charge: 0
multiplicity: 1
keywords: wb97x-d3
keywords: def2-TZVPP
keywords: def2/J RIJCOSX
keywords: DEFGRID2
keywords: scfconv7
keywords: smallprint printgap noloewdin
keywords: NOSOSCF
formula: C12H11ClF2N2O2
InChI: InChI=1/C12H11ClF2N2O2/c13-10-2-1-8(4-16-10)5-17(6-11(14)15)9-3-12(18)19-7-9/h1-4,11H,5-7H2
30 atoms
Cl 4.690936 -2.273351 1.403462
F  -2.601831 3.123052 -1.037061
F  -1.142593 4.489695 -0.144217
O  -3.78003 -0.794916 0.747423
O  -3.682184 -2.881813 -0.054316
N  -0.854079 0.900321 -0.503508
N  2.363475 -1.125282 1.286356
C  0.215174 0.485033 -1.37618
C  -1.833322 0.015674 -0.192863
C  -0.754603 2.20172 0.106349
C  -3.003165 0.368857 0.687911
C  1.351789 -0.232845 -0.688807
C  -1.968723 -1.269579 -0.564619
C  -1.28268 3.307047 -0.788315
C  -3.195609 -1.795655 0.020551
C  2.464922 -0.634277 -1.423557
C  1.35931 -0.515851 0.667578
C  3.511489 -1.274569 -0.794975
C  3.398175 -1.485984 0.575098
H  0.611124 1.367912 -1.886788
H  -0.200815 -0.144924 -2.167087
H  -1.292258 2.231536 1.056098
H  0.29137 2.415043 0.344743
H  -2.684507 0.650889 1.698046
H  -3.587292 1.194672 0.27559
H  -1.313489 -1.876315 -1.167818
H  -0.765794 3.370513 -1.749808
H  2.515089 -0.446071 -2.490015
H  0.521103 -0.247001 1.299542
H  4.387031 -1.598973 -1.33802
totalener: -1383.84649578 hartree
nucrepener: 1537.37321699 hartree
electener: -2921.21971277 hartree
oneelecener: -4952.37746824 hartree
twoeener: 2031.15775547 hartree
kineticenergy: 1379.63895312 hartree
xcener: -105.391749081605 hartree
chargesum: 0.0000000
charge: -0.055831 -0.195791 -0.191912 -0.250672 -0.325333 -0.125642 -0.257972 -0.048797 0.086112 -0.139597 0.036871 0.013252 -0.281658 0.336163 0.307713 -0.160538 0.018901 -0.150349 0.182898 0.111407 0.122090 0.108893 0.125945 0.088449 0.110369 0.115317 0.062333 0.123151 0.106313 0.127913
qa: -0.0558 -0.1958 -0.1919 -0.2507 -0.3253 -0.1256 -0.2580 -0.0488 0.0861 -0.1396 0.0369 0.0133 -0.2817 0.3362 0.3077 -0.1605 0.0189 -0.1503 0.1829 0.1114 0.1221 0.1089 0.1259 0.0884 0.1104 0.1153 0.0623 0.1232 0.1063 0.1279
va: 1.2441 1.0840 1.0979 2.1282 2.1961 3.0247 3.0955 3.8399 3.8162 3.8692 4.0138 3.5522 3.7674 4.1536 4.4166 4.0463 4.0547 3.9946 4.1486 0.9900 0.9923 1.0262 1.0052 0.9892 0.9995 1.0203 0.9904 1.0077 1.0095 1.0138
dispcorr: -0.014483768 hartree
energy: -1383.860979543731
dipole: -4.31751 6.13569 1.81817 2.45535 -0.34400 2.11135 -6.46916 5.05009 -1.41907
magnitude: 3.12687 au
magnitude: 7.94788 debye
