program: Orca
programVersion: 5.0.2
elementType: Cl F F O O N N C C C C C C C C C C C C H H H H H H H H H H H
charge: 0
multiplicity: 1
keywords: wb97x-d3
keywords: def2-TZVPP
keywords: def2/J RIJCOSX
keywords: DEFGRID2
keywords: scfconv7
keywords: smallprint printgap noloewdin
keywords: NOSOSCF
formula: C12H11ClF2N2O2
InChI: InChI=1/C12H11ClF2N2O2/c13-10-2-1-8(4-16-10)5-17(6-11(14)15)9-3-12(18)19-7-9/h1-4,11H,5-7H2
30 atoms
Cl 4.729568 -2.513992 -0.458039
F  -2.816666 3.201077 -0.002769
F  -1.017235 3.739435 1.101612
O  -3.566117 -0.962437 -1.23507
O  -3.599215 -2.817797 0.014289
N  -0.877568 1.066662 0.051348
N  2.466357 -1.307869 -0.88212
C  0.078827 0.848967 1.110678
C  -1.802393 0.108253 -0.198529
C  -0.773194 2.267762 -0.733749
C  -2.819104 0.219366 -1.303846
C  1.248103 -0.026816 0.730994
C  -1.985695 -1.075408 0.413342
C  -1.494459 3.461924 -0.138189
C  -3.103591 -1.759384 -0.22327
C  2.232847 -0.308508 1.6748
C  1.422657 -0.564183 -0.534393
C  3.320158 -1.082888 1.329017
C  3.377415 -1.552661 0.021488
H  -0.441567 0.423852 1.973916
H  0.453277 1.815799 1.446852
H  0.280706 2.530582 -0.86264
H  -1.158643 2.107041 -1.742969
H  -3.472222 1.085374 -1.174953
H  -2.340328 0.297474 -2.287208
H  -1.431224 -1.512262 1.227203
H  -1.377149 4.35471 -0.759446
H  2.151588 0.07908 2.683938
H  0.689832 -0.399628 -1.315467
H  4.098498 -1.316476 2.040479
totalener: -1383.84679319 hartree
nucrepener: 1550.81601526 hartree
electener: -2934.66280845 hartree
oneelecener: -4979.60823635 hartree
twoeener: 2044.94542790 hartree
kineticenergy: 1379.63885200 hartree
xcener: -105.392596358818 hartree
chargesum: 0.0000000
charge: -0.059523 -0.195081 -0.200878 -0.252104 -0.325982 -0.110497 -0.260285 -0.058657 0.078529 -0.144823 0.041115 0.019774 -0.279775 0.326403 0.308035 -0.156919 0.020716 -0.152009 0.183233 0.118321 0.123081 0.123908 0.104995 0.107964 0.086226 0.116061 0.086983 0.123979 0.100695 0.126517
qa: -0.0595 -0.1951 -0.2009 -0.2521 -0.3260 -0.1105 -0.2603 -0.0587 0.0785 -0.1448 0.0411 0.0198 -0.2798 0.3264 0.3080 -0.1569 0.0207 -0.1520 0.1832 0.1183 0.1231 0.1239 0.1050 0.1080 0.0862 0.1161 0.0870 0.1240 0.1007 0.1265
va: 1.2402 1.0854 1.0797 2.1282 2.1960 3.0342 3.0953 3.8136 3.8212 3.9262 4.0031 3.5439 3.7645 4.1043 4.4166 4.0433 4.0556 3.9922 4.1472 0.9935 1.0047 1.0024 1.0110 0.9985 0.9877 1.0197 0.9895 1.0078 1.0124 1.0140
dispcorr: -0.014667226 hartree
energy: -1383.861460420875
dipole: -5.19108 6.63299 1.44191 5.89455 -2.96868 2.92587 0.71500 -0.38836 0.32664
magnitude: 3.27818 au
magnitude: 8.33248 debye
