program: Orca
programVersion: 5.0.2
elementType: Cl F F O O N N C C C C C C C C C C C C H H H H H H H H H H H
charge: 0
multiplicity: 1
keywords: wb97x-d3
keywords: def2-TZVPP
keywords: def2/J RIJCOSX
keywords: DEFGRID2
keywords: scfconv7
keywords: smallprint printgap noloewdin
keywords: NOSOSCF
formula: C12H11ClF2N2O2
InChI: InChI=1/C12H11ClF2N2O2/c13-10-2-1-8(4-16-10)5-17(6-11(14)15)9-3-12(18)19-7-9/h1-4,11H,5-7H2
30 atoms
Cl 4.689395 -2.490051 0.862131
F  -0.956004 3.960622 -0.512867
F  -2.866112 3.104665 0.097936
O  -2.84891 -1.830754 -0.79497
O  -4.536131 -1.842173 0.674297
N  -0.874088 1.090568 -0.079556
N  2.387675 -1.306785 1.104847
C  0.264121 1.044359 -0.966865
C  -1.818898 0.11832 -0.10407
C  -0.905224 2.100927 0.945304
C  -1.748862 -1.017639 -1.090373
C  1.388268 0.139549 -0.519135
C  -2.905368 -0.071233 0.665597
C  -1.613442 3.373724 0.523931
C  -3.560291 -1.304246 0.248724
C  2.493358 -0.052635 -1.346245
C  1.396055 -0.520927 0.699482
C  3.527524 -0.867722 -0.938977
C  3.411902 -1.468378 0.31073
H  0.64531 2.05942 -1.085104
H  -0.063489 0.751851 -1.968157
H  -1.393021 1.706713 1.840271
H  0.115096 2.356052 1.245031
H  -1.816581 -0.65968 -2.123619
H  -0.82048 -1.589449 -0.990978
H  -3.303573 0.548482 1.451393
H  -1.666793 4.095416 1.344685
H  2.543485 0.433443 -2.313932
H  0.56441 -0.432385 1.390147
H  4.393512 -1.038955 -1.561522
totalener: -1383.84603829 hartree
nucrepener: 1550.52863232 hartree
electener: -2934.37467060 hartree
oneelecener: -4978.94368227 hartree
twoeener: 2044.56901167 hartree
kineticenergy: 1379.62883157 hartree
xcener: -105.390385533781 hartree
chargesum: -0.0000000
charge: -0.055330 -0.205951 -0.185877 -0.253481 -0.328155 -0.102137 -0.257493 -0.066602 0.083073 -0.133786 0.048650 -0.004137 -0.276047 0.320192 0.306422 -0.154989 0.002857 -0.153220 0.183524 0.126898 0.111986 0.109315 0.121835 0.093330 0.107237 0.108699 0.084025 0.124639 0.116087 0.128438
qa: -0.0553 -0.2060 -0.1859 -0.2535 -0.3282 -0.1021 -0.2575 -0.0666 0.0831 -0.1338 0.0487 -0.0041 -0.2760 0.3202 0.3064 -0.1550 0.0029 -0.1532 0.1835 0.1269 0.1120 0.1093 0.1218 0.0933 0.1072 0.1087 0.0840 0.1246 0.1161 0.1284
va: 1.2444 1.0723 1.0971 2.1262 2.1936 3.0327 3.0972 3.8221 3.8410 3.8791 4.0043 3.5265 3.8024 4.1464 4.4153 4.0404 4.0474 3.9947 4.1474 1.0034 0.9964 1.0096 1.0025 0.9888 0.9933 1.0304 0.9878 1.0077 1.0082 1.0136
dispcorr: -0.014745585 hartree
energy: -1383.860783872233
dipole: -3.48284 5.61559 2.13275 4.21037 -1.97832 2.23205 -3.70283 2.93818 -0.76465
magnitude: 3.18046 au
magnitude: 8.08410 debye
