program: Orca
programVersion: 5.0.2
elementType: Cl F F O O N N C C C C C C C C C C C C H H H H H H H H H H H
charge: 0
multiplicity: 1
keywords: wb97x-d3
keywords: def2-TZVPP
keywords: def2/J RIJCOSX
keywords: DEFGRID2
keywords: scfconv7
keywords: smallprint printgap noloewdin
keywords: NOSOSCF
formula: C12H11ClF2N2O2
InChI: InChI=1/C12H11ClF2N2O2/c13-10-2-1-8(4-16-10)5-17(6-11(14)15)9-3-12(18)19-7-9/h1-4,11H,5-7H2
30 atoms
Cl 4.781173 -2.510244 0.782454
F  -2.08673 4.204874 0.942584
F  -1.346865 3.604101 -1.028263
O  -2.790559 -1.977508 -0.824506
O  -4.590879 -1.900984 0.502632
N  -0.854265 0.967323 -0.099281
N  2.538137 -1.237998 1.108648
C  0.285275 0.957722 -0.988755
C  -1.785811 -0.013815 -0.141032
C  -1.064189 2.10348 0.762411
C  -1.658845 -1.191159 -1.071023
C  1.410974 0.045407 -0.566932
C  -2.925836 -0.163266 0.5601
C  -1.944713 3.150613 0.105762
C  -3.570735 -1.401101 0.139962
C  2.41822 -0.279454 -1.472333
C  1.527445 -0.472463 0.713927
C  3.47305 -1.074078 -1.07545
C  3.474615 -1.520262 0.241858
H  0.663394 1.978193 -1.059123
H  -0.030258 0.706008 -2.005929
H  -1.52302 1.780787 1.699739
H  -0.102416 2.551221 1.022841
H  -1.644191 -0.877652 -2.120681
H  -0.747682 -1.766683 -0.88009
H  -3.355588 0.476822 1.313196
H  -2.934436 2.773206 -0.161712
H  2.378843 0.08826 -2.491396
H  0.771688 -0.273418 1.46565
H  4.266662 -1.343888 -1.756704
totalener: -1383.84765299 hartree
nucrepener: 1535.68781634 hartree
electener: -2919.53546933 hartree
oneelecener: -4948.89667386 hartree
twoeener: 2029.36120453 hartree
kineticenergy: 1379.62960374 hartree
xcener: -105.389825532107 hartree
chargesum: 0.0000000
charge: -0.054617 -0.192320 -0.203975 -0.252187 -0.325128 -0.121026 -0.257686 -0.063833 0.104471 -0.129982 0.055854 -0.017266 -0.316264 0.330200 0.307137 -0.144602 0.013978 -0.155711 0.183898 0.120577 0.111732 0.115702 0.120340 0.092308 0.111076 0.120142 0.082628 0.122284 0.113824 0.128444
qa: -0.0546 -0.1923 -0.2040 -0.2522 -0.3251 -0.1210 -0.2577 -0.0638 0.1045 -0.1300 0.0559 -0.0173 -0.3163 0.3302 0.3071 -0.1446 0.0140 -0.1557 0.1839 0.1206 0.1117 0.1157 0.1203 0.0923 0.1111 0.1201 0.0826 0.1223 0.1138 0.1284
va: 1.2449 1.0974 1.0712 2.1300 2.1967 3.0253 3.0925 3.8093 3.8091 3.8583 4.0114 3.5625 3.7907 4.1452 4.4260 4.0360 4.0521 4.0022 4.1489 1.0032 0.9975 1.0083 1.0127 0.9909 0.9932 1.0201 0.9881 1.0091 1.0134 1.0134
dispcorr: -0.014602054 hartree
energy: -1383.862255041100
dipole: -5.53178 7.22404 1.69226 1.75759 -0.18183 1.57576 -5.55130 4.30748 -1.24381
magnitude: 2.62561 au
magnitude: 6.67377 debye
