program: Orca
programVersion: 5.0.2
elementType: Cl F F O O N N C C C C C C C C C C C C H H H H H H H H H H H
charge: 0
multiplicity: 1
keywords: wb97x-d3
keywords: def2-TZVPP
keywords: def2/J RIJCOSX
keywords: DEFGRID2
keywords: scfconv7
keywords: smallprint printgap noloewdin
keywords: NOSOSCF
formula: C12H11ClF2N2O2
InChI: InChI=1/C12H11ClF2N2O2/c13-10-2-1-8(4-16-10)5-17(6-11(14)15)9-3-12(18)19-7-9/h1-4,11H,5-7H2
30 atoms
Cl 4.801853 -0.841052 1.449518
F  -0.29873 3.706318 -0.716483
F  -0.721541 2.198627 0.81598
O  -4.240401 -0.344336 0.702436
O  -4.227984 -2.510342 1.262234
N  -1.233774 0.231813 -1.198241
N  2.223315 -0.855303 1.132216
C  -0.212628 -0.63876 -1.73682
C  -2.229505 -0.280797 -0.435148
C  -1.11496 1.645104 -1.445313
C  -3.412324 0.543434 0.004566
C  1.080306 -0.664973 -0.96119
C  -2.416488 -1.536527 0.012261
C  -0.241937 2.380117 -0.439184
C  -3.686477 -1.593913 0.724737
C  2.306639 -0.563263 -1.607212
C  1.105855 -0.808311 0.422399
C  3.479513 -0.612294 -0.877548
C  3.365275 -0.764058 0.497374
H  -0.005821 -0.330058 -2.766178
H  -0.629707 -1.64492 -1.810348
H  -0.691483 1.797385 -2.441723
H  -2.099628 2.118329 -1.458602
H  -3.121856 1.372136 0.654059
H  -3.950459 0.955956 -0.856366
H  -1.779301 -2.399801 -0.090199
H  0.802483 2.064431 -0.451675
H  2.350254 -0.444741 -2.683654
H  0.185048 -0.886277 0.990487
H  4.446291 -0.533549 -1.352625
totalener: -1383.84623684 hartree
nucrepener: 1568.39669291 hartree
electener: -2952.24292975 hartree
oneelecener: -5014.46684554 hartree
twoeener: 2062.22391579 hartree
kineticenergy: 1379.63742438 hartree
xcener: -105.390810739775 hartree
chargesum: 0.0000000
charge: -0.052938 -0.194581 -0.197350 -0.249831 -0.324845 -0.110181 -0.248794 -0.039872 0.131162 -0.135364 0.014418 -0.070911 -0.309069 0.340992 0.299638 -0.135444 0.022587 -0.145951 0.176840 0.109148 0.121092 0.104219 0.107766 0.109438 0.090139 0.123743 0.081499 0.119886 0.133821 0.128744
qa: -0.0529 -0.1946 -0.1973 -0.2498 -0.3248 -0.1102 -0.2488 -0.0399 0.1312 -0.1354 0.0144 -0.0709 -0.3091 0.3410 0.2996 -0.1354 0.0226 -0.1460 0.1768 0.1091 0.1211 0.1042 0.1078 0.1094 0.0901 0.1237 0.0815 0.1199 0.1338 0.1287
va: 1.2468 1.0981 1.0789 2.1287 2.1975 3.0685 3.0923 3.7960 3.7849 3.8839 4.0267 3.5730 3.7474 4.1049 4.4262 4.0013 4.0305 4.0011 4.1516 0.9997 1.0006 1.0162 1.0210 1.0012 0.9845 1.0170 0.9812 1.0109 1.0076 1.0131
dispcorr: -0.015316681 hartree
energy: -1383.861553523084
dipole: -9.85970 11.37485 1.51515 -2.32982 3.50572 1.17589 -13.54891 10.60408 -2.94483
magnitude: 3.51431 au
magnitude: 8.93268 debye
