program: Orca
programVersion: 5.0.2
elementType: O O O N N N N C C C C C C C H H H H H H H H H H H H H H
charge: 0
multiplicity: 1
keywords: wb97x-d3
keywords: def2-TZVPP
keywords: def2/J RIJCOSX
keywords: DEFGRID2
keywords: scfconv7
keywords: smallprint printgap noloewdin
keywords: NOSOSCF
formula: C7H14N4O3
InChI: InChI=1/C7H14N4O3/c1-8-7(10-11(12)13)9-4-6-2-3-14-5-6/h6,8-9H,2-5H2,1H3
28 atoms
O  -3.928349 0.610496 -0.532778
O  3.576015 -0.082881 -0.93869
O  3.246974 1.82148 -0.033294
N  -0.021162 -1.048749 0.589736
N  1.708169 -1.876121 -0.658097
N  1.681475 0.369835 0.18398
N  2.865668 0.686767 -0.285272
C  -1.687598 0.749749 0.210503
C  -2.537947 1.84222 0.887834
C  -2.741793 -0.155369 -0.451572
C  -0.8160 -0.001554 1.205417
C  -3.971961 1.376218 0.658211
C  1.163756 -0.863822 0.003361
C  1.081595 -3.167396 -0.824985
H  -1.04439 1.19379 -0.55181
H  -2.36157 2.810731 0.420412
H  -2.314119 1.947873 1.950512
H  -2.468513 -0.48082 -1.4559
H  -2.910222 -1.055935 0.15839
H  -1.445536 -0.482835 1.955372
H  -0.157677 0.68296 1.733304
H  -4.319213 0.762771 1.499929
H  -4.681797 2.192719 0.522632
H  -0.49285 -1.926613 0.432283
H  2.615714 -1.708952 -1.063976
H  1.754217 -3.793274 -1.402113
H  0.139067 -3.0948 -1.369876
H  0.901282 -3.660343 0.131172
elementType: O N C H
totalener: -719.85047425 hartree
nucrepener: 953.49808206 hartree
electener: -1673.34855631 hartree
oneelecener: -2872.37655770 hartree
twoeener: 1199.02800139 hartree
cpcmener: -0.05352464 hartree
kineticenergy: 716.91504989 hartree
xcener: -66.962816427129 hartree
chargesum: -0.0000000
charge: -0.415787 -0.487258 -0.486064 -0.200351 -0.195307 -0.364471 0.531420 0.045897 -0.171892 -0.014655 -0.082226 0.023898 0.405545 -0.179020 0.072504 0.086231 0.076313 0.102883 0.082432 0.126338 0.105558 0.078318 0.097818 0.191075 0.202508 0.121052 0.123646 0.123597
qa: -0.4158 -0.4873 -0.4861 -0.2004 -0.1953 -0.3645 0.5314 0.0459 -0.1719 -0.0147 -0.0822 0.0239 0.4055 -0.1790 0.0725 0.0862 0.0763 0.1029 0.0824 0.1263 0.1056 0.0783 0.0978 0.1911 0.2025 0.1211 0.1236 0.1236
va: 1.9130 1.7735 1.7479 3.2752 3.2827 2.7205 4.3132 3.7281 3.9428 3.9620 3.9269 3.9295 4.2129 3.8837 1.0269 1.0087 1.0171 0.9942 1.0020 0.9938 1.0245 0.9984 0.9958 1.0015 1.0321 0.9960 0.9876 0.9877
dispcorr: -0.010601264 hartree
energy: -719.861075511239
dipole: -15.83322 13.23351 -2.59971 -6.31699 2.71334 -3.60365 2.96193 -2.25709 0.70484
magnitude: 4.49906 au
magnitude: 11.43571 debye
