program: Orca
programVersion: 5.0.2
elementType: O O O N N N N C C C C C C C H H H H H H H H H H H H H H
charge: 0
multiplicity: 1
keywords: wb97x-d3
keywords: def2-TZVPP
keywords: def2/J RIJCOSX
keywords: DEFGRID2
keywords: scfconv7
keywords: smallprint printgap noloewdin
keywords: NOSOSCF
formula: C7H14N4O3
InChI: InChI=1/C7H14N4O3/c1-8-7(10-11(12)13)9-4-6-2-3-14-5-6/h6,8-9H,2-5H2,1H3
28 atoms
O  -3.816836 1.529492 0.958846
O  3.681998 -0.148499 0.285785
O  3.158681 1.917719 0.184741
N  -0.092328 -0.821695 -0.938195
N  1.822893 -1.879909 -0.277242
N  1.614563 0.51039 -0.307146
N  2.852715 0.738791 0.06472
C  -1.81815 0.554925 0.181577
C  -2.79196 -0.560108 0.553353
C  -2.772254 1.729609 0.01843
C  -1.004477 0.297468 -1.073722
C  -3.818611 0.17395 1.402114
C  1.16139 -0.749901 -0.485856
C  1.26386 -3.198562 -0.471545
H  -1.140925 0.748319 1.019925
H  -2.328269 -1.385211 1.093329
H  -3.254499 -0.968301 -0.349933
H  -2.293176 2.692596 0.209061
H  -3.177084 1.75613 -1.002552
H  -0.443951 1.183431 -1.361172
H  -1.676633 0.062049 -1.900823
H  -4.822199 -0.245198 1.297859
H  -3.552786 0.137685 2.463288
H  -0.51532 -1.735096 -1.006429
H  2.778976 -1.787619 0.029304
H  0.412219 -3.380572 0.185879
H  2.0327 -3.9260 -0.232358
H  0.954852 -3.363097 -1.504892
elementType: O N C H
totalener: -719.85085113 hartree
nucrepener: 950.54799846 hartree
electener: -1670.39884960 hartree
oneelecener: -2866.40334286 hartree
twoeener: 1196.00449326 hartree
cpcmener: -0.05457774 hartree
kineticenergy: 716.91164296 hartree
xcener: -66.965221246127 hartree
chargesum: -0.0000000
charge: -0.423359 -0.486915 -0.486719 -0.202651 -0.194946 -0.366206 0.529640 0.006966 -0.187625 0.034610 -0.058007 0.060292 0.408649 -0.178898 0.072621 0.086519 0.083920 0.091018 0.067913 0.111644 0.115305 0.077662 0.074993 0.193529 0.202156 0.122999 0.121277 0.123612
qa: -0.4234 -0.4869 -0.4867 -0.2027 -0.1949 -0.3662 0.5296 0.0070 -0.1876 0.0346 -0.0580 0.0603 0.4086 -0.1789 0.0726 0.0865 0.0839 0.0910 0.0679 0.1116 0.1153 0.0777 0.0750 0.1935 0.2022 0.1230 0.1213 0.1236
va: 1.9291 1.7739 1.7466 3.2842 3.2809 2.7199 4.3142 3.8432 3.9687 3.9858 3.8605 3.9469 4.2079 3.8840 1.0221 1.0155 1.0077 0.9921 0.9932 1.0251 1.0033 0.9911 0.9888 0.9984 1.0328 0.9878 0.9959 0.9880
dispcorr: -0.010505741 hartree
energy: -719.861356875016
dipole: -15.93115 13.43805 -2.49310 -9.60990 5.19613 -4.41377 -1.16851 0.02705 -1.14146
magnitude: 5.19614 au
magnitude: 13.20753 debye
