program: Orca
programVersion: 5.0.2
elementType: O O O N N N N C C C C C C C H H H H H H H H H H H H H H
charge: 0
multiplicity: 1
keywords: wb97x-d3
keywords: def2-TZVPP
keywords: def2/J RIJCOSX
keywords: DEFGRID2
keywords: scfconv7
keywords: smallprint printgap noloewdin
keywords: NOSOSCF
formula: C7H14N4O3
InChI: InChI=1/C7H14N4O3/c1-8-7(10-11(12)13)9-4-6-2-3-14-5-6/h6,8-9H,2-5H2,1H3
28 atoms
O  -3.842332 1.493085 0.888947
O  3.661394 -0.169988 0.288515
O  3.128666 1.896231 0.243405
N  -0.121145 -0.831261 -0.912979
N  1.79445 -1.895973 -0.261396
N  1.590084 0.494145 -0.282044
N  2.828361 0.719931 0.092229
C  -1.710311 0.594066 0.359018
C  -2.660338 -0.514829 0.8502
C  -2.633873 1.81915 0.229392
C  -1.042587 0.286627 -0.974596
C  -4.039206 0.106914 0.67643
C  1.135444 -0.763862 -0.465895
C  1.226161 -3.211407 -0.450262
H  -0.933755 0.784948 1.101854
H  -2.472799 -0.746841 1.898799
H  -2.561773 -1.445858 0.2896
H  -2.217872 2.717899 0.6857
H  -2.824888 2.041441 -0.830398
H  -0.518811 1.162646 -1.350942
H  -1.800113 0.028451 -1.715904
H  -4.427266 -0.080224 -0.333658
H  -4.77763 -0.255469 1.39243
H  -0.547007 -1.743949 -0.969332
H  2.756823 -1.80744 0.025522
H  0.926324 -3.382306 -1.485201
H  0.366176 -3.379532 0.200027
H  1.985237 -3.943441 -0.195436
elementType: O N C H
totalener: -719.85078329 hartree
nucrepener: 954.26787951 hartree
electener: -1674.11866280 hartree
oneelecener: -2873.87473901 hartree
twoeener: 1199.75607620 hartree
cpcmener: -0.05431044 hartree
kineticenergy: 716.91507343 hartree
xcener: -66.963072885058 hartree
chargesum: 0.0000000
charge: -0.414427 -0.487025 -0.485835 -0.211617 -0.193206 -0.365244 0.532858 0.023301 -0.163574 0.008725 -0.064968 0.019848 0.405121 -0.179329 0.072127 0.086788 0.069319 0.097177 0.073053 0.112102 0.123473 0.079372 0.098440 0.192861 0.202248 0.124715 0.122302 0.121394
qa: -0.4144 -0.4870 -0.4858 -0.2116 -0.1932 -0.3652 0.5329 0.0233 -0.1636 0.0087 -0.0650 0.0198 0.4051 -0.1793 0.0721 0.0868 0.0693 0.0972 0.0731 0.1121 0.1235 0.0794 0.0984 0.1929 0.2022 0.1247 0.1223 0.1214
va: 1.9127 1.7736 1.7485 3.2793 3.2836 2.7236 4.3108 3.7768 3.9113 3.9702 3.9011 3.9331 4.2120 3.8844 1.0262 1.0080 1.0256 0.9935 1.0010 1.0214 1.0005 0.9981 0.9964 0.9992 1.0326 0.9875 0.9882 0.9960
dispcorr: -0.010638064 hartree
energy: -719.861421353108
dipole: -15.81840 13.25898 -2.55942 -9.38664 5.08604 -4.30060 -1.52165 0.31519 -1.20646
magnitude: 5.14795 au
magnitude: 13.08504 debye
