program: Orca
programVersion: 5.0.2
elementType: O O O N N N N C C C C C C C H H H H H H H H H H H H H H
charge: 0
multiplicity: 1
keywords: wb97x-d3
keywords: def2-TZVPP
keywords: def2/J RIJCOSX
keywords: DEFGRID2
keywords: scfconv7
keywords: smallprint printgap noloewdin
keywords: NOSOSCF
formula: C7H14N4O3
InChI: InChI=1/C7H14N4O3/c1-8-7(10-11(12)13)9-4-6-2-3-14-5-6/h6,8-9H,2-5H2,1H3
28 atoms
O  -3.939586 1.510046 0.795773
O  3.724797 -0.188994 0.247422
O  3.188647 1.876508 0.276115
N  -0.117399 -0.826632 -0.759751
N  1.837618 -1.902234 -0.25982
N  1.621769 0.4825 -0.178883
N  2.884882 0.706656 0.123066
C  -1.782213 0.589153 0.421008
C  -2.786867 -0.515016 0.805657
C  -2.674404 1.836673 0.260547
C  -1.017076 0.303997 -0.866892
C  -4.138145 0.135646 0.532294
C  1.163062 -0.765235 -0.385385
C  1.278899 -3.21407 -0.483252
H  -1.059612 0.744625 1.224492
H  -2.692645 -0.774536 1.86084
H  -2.656769 -1.43573 0.233615
H  -2.286165 2.707806 0.790301
H  -2.76419 2.108686 -0.801715
H  -0.448655 1.179887 -1.173077
H  -1.719065 0.080152 -1.67289
H  -4.444676 -0.023262 -0.511285
H  -4.940116 -0.231188 1.174501
H  -0.542229 -1.736594 -0.844124
H  2.808501 -1.810665 -0.001018
H  0.474612 -3.44312 0.219002
H  2.067509 -3.945047 -0.333353
H  0.90273 -3.331482 -1.501463
elementType: O N C H
totalener: -719.85179251 hartree
nucrepener: 950.17066092 hartree
electener: -1670.02245343 hartree
oneelecener: -2865.71606374 hartree
twoeener: 1195.69361031 hartree
cpcmener: -0.04331786 hartree
kineticenergy: 716.90760761 hartree
xcener: -66.960443914329 hartree
chargesum: -0.0000000
charge: -0.393888 -0.474051 -0.453460 -0.207055 -0.203445 -0.365510 0.513206 0.026909 -0.167148 0.007320 -0.077849 0.019375 0.408575 -0.183081 0.071613 0.087194 0.065850 0.095792 0.069471 0.114689 0.124472 0.074744 0.096245 0.186553 0.200387 0.121614 0.120479 0.121001
qa: -0.3939 -0.4741 -0.4535 -0.2071 -0.2034 -0.3655 0.5132 0.0269 -0.1671 0.0073 -0.0778 0.0194 0.4086 -0.1831 0.0716 0.0872 0.0658 0.0958 0.0695 0.1147 0.1245 0.0747 0.0962 0.1866 0.2004 0.1216 0.1205 0.1210
va: 1.9361 1.7874 1.7904 3.2728 3.2681 2.7179 4.3480 3.7742 3.9132 3.9806 3.8892 3.9439 4.2059 3.8877 1.0259 1.0077 1.0255 0.9925 1.0001 1.0255 1.0002 0.9974 0.9959 1.0018 1.0374 0.9869 0.9968 0.9881
dispcorr: -0.010476899 hartree
energy: -719.862269409541
dipole: -16.00725 13.59599 -2.41126 -9.26138 5.26312 -3.99826 -1.76932 0.64941 -1.11992
magnitude: 4.80150 au
magnitude: 12.20445 debye
