program: Orca
programVersion: 5.0.2
elementType: O O O N N N N C C C C C C C H H H H H H H H H H H H H H
charge: 0
multiplicity: 1
keywords: wb97x-d3
keywords: def2-TZVPP
keywords: def2/J RIJCOSX
keywords: DEFGRID2
keywords: scfconv7
keywords: smallprint printgap noloewdin
keywords: NOSOSCF
formula: C7H14N4O3
InChI: InChI=1/C7H14N4O3/c1-8-7(10-11(12)13)9-4-6-2-3-14-5-6/h6,8-9H,2-5H2,1H3
28 atoms
O  -3.894733 1.480322 0.848634
O  3.054019 1.910486 0.397167
O  3.653353 -0.136757 0.33373
N  -0.126393 -0.853398 -0.834723
N  1.838785 -1.892891 -0.300355
N  1.54869 0.484613 -0.156498
N  2.792734 0.736571 0.200814
C  -1.74303 0.600793 0.37271
C  -2.682214 -0.507429 0.886655
C  -2.687853 1.803859 0.190887
C  -1.046839 0.260728 -0.938856
C  -4.070241 0.088175 0.684572
C  1.13877 -0.77031 -0.415248
C  1.324145 -3.208759 -0.595212
H  -0.98151 0.832223 1.119194
H  -2.501436 -0.708814 1.942812
H  -2.564776 -1.452437 0.353839
H  -2.291904 2.7257 0.619294
H  -2.870109 1.988072 -0.878626
H  -0.515574 1.129719 -1.323573
H  -1.788976 -0.016332 -1.68994
H  -4.451475 -0.142273 -0.320069
H  -4.808299 -0.259518 1.408935
H  -0.526213 -1.76964 -0.958834
H  2.796519 -1.79004 -0.001897
H  0.499187 -3.484229 0.06492
H  2.124997 -3.925365 -0.441467
H  0.991127 -3.295448 -1.631258
elementType: O N C H
totalener: -719.85197508 hartree
nucrepener: 953.33504029 hartree
electener: -1673.18701537 hartree
oneelecener: -2872.10895689 hartree
twoeener: 1198.92194153 hartree
cpcmener: -0.04326081 hartree
kineticenergy: 716.92095606 hartree
xcener: -66.962929561990 hartree
chargesum: 0.0000000
charge: -0.393634 -0.453913 -0.474338 -0.210435 -0.202897 -0.365503 0.514247 0.023762 -0.166151 0.007258 -0.071742 0.020398 0.409905 -0.181898 0.073856 0.086893 0.063967 0.095727 0.068957 0.114443 0.121092 0.074404 0.095518 0.187251 0.200384 0.120930 0.120373 0.121146
qa: -0.3936 -0.4539 -0.4743 -0.2104 -0.2029 -0.3655 0.5142 0.0238 -0.1662 0.0073 -0.0717 0.0204 0.4099 -0.1819 0.0739 0.0869 0.0640 0.0957 0.0690 0.1144 0.1211 0.0744 0.0955 0.1873 0.2004 0.1209 0.1204 0.1211
va: 1.9352 1.7904 1.7874 3.2673 3.2706 2.7169 4.3467 3.7641 3.9145 3.9820 3.8909 3.9436 4.2029 3.8873 1.0292 1.0075 1.0259 0.9929 1.0005 1.0227 1.0011 0.9973 0.9961 1.0023 1.0360 0.9870 0.9969 0.9885
dispcorr: -0.010563488 hartree
energy: -719.862538568716
dipole: -15.47283 13.20911 -2.26372 -9.47620 5.41364 -4.06256 -2.29546 0.95096 -1.34450
magnitude: 4.84113 au
magnitude: 12.30518 debye
