program: Orca
programVersion: 5.0.2
elementType: O O O N N N N C C C C C C C H H H H H H H H H H H H H H
charge: 0
multiplicity: 1
keywords: wb97x-d3
keywords: def2-TZVPP
keywords: def2/J RIJCOSX
keywords: DEFGRID2
keywords: scfconv7
keywords: smallprint printgap noloewdin
keywords: NOSOSCF
formula: C7H14N4O3
InChI: InChI=1/C7H14N4O3/c1-8-7(10-11(12)13)9-4-6-2-3-14-5-6/h6,8-9H,2-5H2,1H3
28 atoms
O  -3.790301 -0.754509 -0.688325
O  3.500361 0.016774 -0.961288
O  3.133123 -1.838568 0.027482
N  -0.012568 1.172007 0.622379
N  1.708902 1.886457 -0.700601
N  1.628444 -0.321959 0.235296
N  2.786558 -0.700552 -0.254704
C  -1.708525 -0.626789 0.381392
C  -2.553953 -1.659597 1.12229
C  -2.796181 0.18318 -0.312585
C  -0.82484 0.186883 1.310831
C  -3.723063 -1.892307 0.170341
C  1.149424 0.920024 0.016037
C  1.123458 3.19383 -0.890543
H  -1.088017 -1.125399 -0.369764
H  -2.901083 -1.244425 2.072209
H  -2.008969 -2.577031 1.34117
H  -3.206454 0.93456 0.378378
H  -2.453636 0.706145 -1.207484
H  -0.182529 -0.466216 1.896258
H  -1.448616 0.735387 2.017916
H  -3.57032 -2.785688 -0.441441
H  -4.668606 -2.015543 0.705539
H  -0.458422 2.056983 0.435516
H  2.597939 1.675657 -1.125688
H  1.797437 3.776128 -1.509964
H  0.993139 3.723626 0.054138
H  0.160991 3.13837 -1.401794
elementType: O N C H
totalener: -719.85086339 hartree
nucrepener: 953.81652492 hartree
electener: -1673.66738831 hartree
oneelecener: -2873.08228325 hartree
twoeener: 1199.41489494 hartree
cpcmener: -0.05325080 hartree
kineticenergy: 716.91653434 hartree
xcener: -66.965849497266 hartree
chargesum: 0.0000000
charge: -0.424765 -0.487232 -0.485034 -0.204440 -0.194921 -0.366890 0.531132 0.013349 -0.192209 0.020715 -0.051069 0.062905 0.408620 -0.179207 0.072892 0.081887 0.088973 0.077137 0.089850 0.106455 0.116329 0.078739 0.073787 0.192986 0.202301 0.121188 0.123677 0.122847
qa: -0.4248 -0.4872 -0.4850 -0.2044 -0.1949 -0.3669 0.5311 0.0133 -0.1922 0.0207 -0.0511 0.0629 0.4086 -0.1792 0.0729 0.0819 0.0890 0.0771 0.0898 0.1065 0.1163 0.0787 0.0738 0.1930 0.2023 0.1212 0.1237 0.1228
va: 1.9255 1.7737 1.7502 3.2777 3.2825 2.7170 4.3141 3.8039 3.9949 3.9721 3.8613 3.9266 4.2090 3.8840 1.0274 1.0062 1.0131 0.9959 0.9957 1.0238 0.9994 0.9891 0.9919 1.0002 1.0317 0.9959 0.9882 0.9879
dispcorr: -0.010556811 hartree
energy: -719.861420204565
dipole: -15.50284 13.08268 -2.42016 6.26173 -2.59662 3.66510 2.83123 -2.11220 0.71903
magnitude: 4.45052 au
magnitude: 11.31232 debye
