program: Orca
programVersion: 5.0.2
elementType: O O O N N N N C C C C C C C H H H H H H H H H H H H H H
charge: 0
multiplicity: 1
keywords: wb97x-d3
keywords: def2-TZVPP
keywords: def2/J RIJCOSX
keywords: DEFGRID2
keywords: scfconv7
keywords: smallprint printgap noloewdin
keywords: NOSOSCF
formula: C7H14N4O3
InChI: InChI=1/C7H14N4O3/c1-8-7(10-11(12)13)9-4-6-2-3-14-5-6/h6,8-9H,2-5H2,1H3
28 atoms
O  -3.113916 0.820621 -0.374926
O  3.698165 0.575582 -0.291276
O  3.787904 -1.52483 -0.657287
N  -0.235208 -0.03079 0.24785
N  1.37848 1.583636 0.337617
N  1.859319 -0.713623 -0.17956
N  3.149375 -0.52528 -0.377351
C  -2.277849 -1.35106 -0.081212
C  -2.984439 -0.90041 1.217488
C  -2.802747 -0.34609 -1.114023
C  -0.758325 -1.366709 0.014186
C  -3.749849 0.360384 0.804254
C  1.04738 0.312907 0.133344
C  0.437956 2.62229 0.683104
H  -2.575934 -2.363839 -0.355059
H  -2.263401 -0.683747 2.008655
H  -3.654458 -1.668137 1.60258
H  -2.078002 -0.089248 -1.889208
H  -3.699246 -0.739034 -1.61146
H  -0.342759 -1.761885 -0.913027
H  -0.447349 -2.041614 0.815816
H  -4.803837 0.1292 0.604251
H  -3.716987 1.156606 1.548999
H  -0.900762 0.692236 0.4763
H  2.355275 1.81128 0.23684
H  -0.339513 2.741785 -0.074344
H  0.981539 3.559747 0.750434
H  -0.037515 2.439864 1.649001
elementType: O N C H
totalener: -719.85210940 hartree
nucrepener: 966.87533767 hartree
electener: -1686.72744706 hartree
oneelecener: -2899.06529926 hartree
twoeener: 1212.33785220 hartree
cpcmener: -0.03778469 hartree
kineticenergy: 716.90825288 hartree
xcener: -66.961166619622 hartree
chargesum: -0.0000000
charge: -0.404493 -0.474374 -0.454517 -0.205957 -0.199912 -0.368339 0.525352 0.070801 -0.200267 -0.021337 -0.092038 0.017976 0.397763 -0.183746 0.073674 0.086538 0.088254 0.105517 0.091460 0.107220 0.111974 0.086961 0.096152 0.185052 0.198149 0.113980 0.124537 0.123623
qa: -0.4045 -0.4744 -0.4545 -0.2060 -0.1999 -0.3683 0.5254 0.0708 -0.2003 -0.0213 -0.0920 0.0180 0.3978 -0.1837 0.0737 0.0865 0.0883 0.1055 0.0915 0.1072 0.1120 0.0870 0.0962 0.1851 0.1981 0.1140 0.1245 0.1236
va: 1.9145 1.7871 1.7885 3.2342 3.2633 2.7430 4.3312 3.7670 3.9448 3.9431 3.9189 3.9235 4.2238 3.8863 1.0163 1.0119 1.0109 0.9990 1.0000 1.0088 1.0036 0.9995 0.9971 1.0169 1.0365 0.9954 0.9956 0.9871
dispcorr: -0.011115792 hartree
energy: -719.863225186985
dipole: -20.17533 16.03134 -4.14399 3.14836 -1.69139 1.45698 4.26823 -3.00274 1.26549
magnitude: 4.57131 au
magnitude: 11.61935 debye
