program: Orca
programVersion: 5.0.2
elementType: O O O N N N N C C C C C C C H H H H H H H H H H H H H H
charge: 0
multiplicity: 1
keywords: wb97x-d3
keywords: def2-TZVPP
keywords: def2/J RIJCOSX
keywords: DEFGRID2
keywords: scfconv7
keywords: smallprint printgap noloewdin
keywords: NOSOSCF
formula: C7H14N4O3
InChI: InChI=1/C7H14N4O3/c1-8-7(10-11(12)13)9-4-6-2-3-14-5-6/h6,8-9H,2-5H2,1H3
28 atoms
O  -3.730094 -0.145036 -0.06101
O  3.127323 -1.787501 0.238383
O  3.532956 -0.002501 -0.861988
N  -0.157337 1.129941 0.237113
N  1.697246 1.787339 -0.948104
N  1.558683 -0.315956 0.182495
N  2.796057 -0.705094 -0.167641
C  -1.570333 -0.933142 0.259599
C  -2.49244 -1.758292 1.167329
C  -2.564629 -0.447395 -0.787699
C  -0.941391 0.217314 1.044302
C  -3.891826 -1.16121 0.907557
C  1.086811 0.862143 -0.20082
C  1.128117 3.05408 -1.317189
H  -0.773399 -1.538704 -0.173137
H  -2.200072 -1.695964 2.217332
H  -2.457451 -2.813232 0.895348
H  -2.246528 0.447508 -1.328201
H  -2.74315 -1.233433 -1.536491
H  -0.309134 -0.187036 1.834192
H  -1.720258 0.814396 1.522542
H  -4.580458 -1.934889 0.547001
H  -4.338124 -0.71576 1.798907
H  -0.596255 1.984143 -0.052676
H  2.629263 1.524401 -1.240921
H  0.884689 3.67102 -0.448157
H  0.231626 2.945588 -1.934271
H  1.859531 3.599829 -1.906205
totalener: -719.82371066 hartree
nucrepener: 962.31386707 hartree
electener: -1682.13757773 hartree
oneelecener: -2890.27407909 hartree
twoeener: 1208.13650136 hartree
kineticenergy: 716.95173377 hartree
xcener: -66.964157916385 hartree
chargesum: -0.0000000
charge: -0.333042 -0.335697 -0.419794 -0.241414 -0.223646 -0.333984 0.458220 0.056193 -0.209948 0.001113 -0.101017 0.033268 0.412991 -0.196083 0.092696 0.073896 0.093342 0.058996 0.076259 0.111766 0.120362 0.066942 0.072833 0.150710 0.187342 0.111672 0.107998 0.108028
qa: -0.3330 -0.3357 -0.4198 -0.2414 -0.2236 -0.3340 0.4582 0.0562 -0.2099 0.0011 -0.1010 0.0333 0.4130 -0.1961 0.0927 0.0739 0.0933 0.0590 0.0763 0.1118 0.1204 0.0669 0.0728 0.1507 0.1873 0.1117 0.1080 0.1080
va: 1.9910 1.9253 1.8355 3.2252 3.2218 2.7336 4.4229 3.6948 3.9616 3.9833 3.8883 3.9513 4.1765 3.9149 1.0382 1.0132 1.0061 1.0077 0.9987 1.0274 1.0006 0.9953 0.9892 1.0277 1.0653 0.9863 0.9850 1.0043
dispcorr: -0.010740631 hartree
energy: -719.834451291602
dipole: -15.39692 13.79771 -1.59921 4.64609 -2.78925 1.85685 0.66657 -0.87602 -0.20945
magnitude: 2.45952 au
magnitude: 6.25160 debye
