program: Orca
programVersion: 5.0.2
elementType: O O O N N N N C C C C C C C H H H H H H H H H H H H H H
charge: 0
multiplicity: 1
keywords: wb97x-d3
keywords: def2-TZVPP
keywords: def2/J RIJCOSX
keywords: DEFGRID2
keywords: scfconv7
keywords: smallprint printgap noloewdin
keywords: NOSOSCF
formula: C7H14N4O3
InChI: InChI=1/C7H14N4O3/c1-8-7(10-11(12)13)9-4-6-2-3-14-5-6/h6,8-9H,2-5H2,1H3
28 atoms
O  -3.921397 -1.465961 0.706079
O  3.515175 0.170569 0.477715
O  2.923581 -1.881515 0.436537
N  -0.151423 0.922205 -0.975245
N  1.80056 1.919155 -0.288463
N  1.450008 -0.44443 -0.190525
N  2.688374 -0.716299 0.257685
C  -1.787674 -0.592363 0.125205
C  -2.669324 0.499653 0.728597
C  -2.795569 -1.72805 -0.105913
C  -1.05878 -0.193909 -1.148237
C  -3.679447 -0.330421 1.503801
C  1.087962 0.801059 -0.459976
C  1.370798 3.236523 -0.668853
H  -1.041953 -0.90702 0.859976
H  -3.172574 1.074719 -0.056456
H  -2.123024 1.198008 1.363562
H  -3.116879 -1.768756 -1.154839
H  -2.35994 -2.701778 0.137477
H  -1.785126 0.101185 -1.910242
H  -0.49612 -1.037573 -1.54475
H  -3.268056 -0.610789 2.483291
H  -4.625333 0.186193 1.677794
H  -0.547565 1.842047 -1.046777
H  2.729677 1.756516 0.07764
H  2.184774 3.930308 -0.479091
H  0.511991 3.582604 -0.086263
H  1.124148 3.302094 -1.731507
totalener: -719.82239710 hartree
nucrepener: 956.01323289 hartree
electener: -1675.83562998 hartree
oneelecener: -2877.51735398 hartree
twoeener: 1201.68172400 hartree
kineticenergy: 716.95338903 hartree
xcener: -66.964623922562 hartree
chargesum: 0.0000000
charge: -0.326665 -0.418908 -0.332874 -0.228096 -0.224041 -0.332861 0.458477 -0.003206 -0.203003 0.048218 -0.088468 0.055980 0.411553 -0.193824 0.094528 0.065452 0.074984 0.048202 0.077492 0.100170 0.122918 0.061569 0.069861 0.147790 0.188094 0.107961 0.102765 0.115931
qa: -0.3267 -0.4189 -0.3329 -0.2281 -0.2240 -0.3329 0.4585 -0.0032 -0.2030 0.0482 -0.0885 0.0560 0.4116 -0.1938 0.0945 0.0655 0.0750 0.0482 0.0775 0.1002 0.1229 0.0616 0.0699 0.1478 0.1881 0.1080 0.1028 0.1159
va: 2.0301 1.8366 1.9289 3.2121 3.2208 2.7381 4.4208 3.7517 3.9644 4.0153 3.8946 4.0082 4.1762 3.9146 1.0243 1.0103 1.0147 0.9883 0.9889 0.9998 1.0262 0.9896 0.9917 1.0288 1.0649 1.0044 0.9843 0.9879
dispcorr: -0.010608480 hartree
energy: -719.833005577816
dipole: -14.32392 13.05647 -1.26745 9.09467 -6.38571 2.70895 -1.79115 1.01473 -0.77642
magnitude: 3.08993 au
magnitude: 7.85399 debye
