program: Orca
programVersion: 5.0.2
elementType: O O O N N N N C C C C C C C H H H H H H H H H H H H H H
charge: 0
multiplicity: 1
keywords: wb97x-d3
keywords: def2-TZVPP
keywords: def2/J RIJCOSX
keywords: DEFGRID2
keywords: scfconv7
keywords: smallprint printgap noloewdin
keywords: NOSOSCF
formula: C7H14N4O3
InChI: InChI=1/C7H14N4O3/c1-8-7(10-11(12)13)9-4-6-2-3-14-5-6/h6,8-9H,2-5H2,1H3
28 atoms
O  -3.776842 -0.817722 -0.654225
O  3.365649 0.006802 -1.086988
O  2.945793 -1.880327 -0.178915
N  -0.071931 1.215261 0.5987
N  1.68437 1.911308 -0.707907
N  1.491605 -0.323749 0.123321
N  2.656129 -0.735959 -0.407139
C  -1.694911 -0.664539 0.440559
C  -2.593542 -1.620739 1.218629
C  -2.725187 0.082824 -0.403021
C  -0.851411 0.233588 1.328977
C  -3.669562 -1.948734 0.190744
C  1.085235 0.928069 -0.028779
C  1.213966 3.266936 -0.783875
H  -1.026291 -1.239499 -0.205883
H  -3.026251 -1.116855 2.088802
H  -2.067568 -2.505607 1.576444
H  -3.09999 0.963791 0.143989
H  -2.315702 0.437187 -1.353043
H  -0.175468 -0.366211 1.9358
H  -1.497993 0.789123 2.013696
H  -3.388235 -2.829029 -0.398323
H  -4.63975 -2.155787 0.649599
H  -0.50194 2.105245 0.423828
H  2.551353 1.632788 -1.148474
H  1.930186 3.845861 -1.359778
H  1.132047 3.734354 0.200677
H  0.250096 3.348992 -1.294713
totalener: -719.82263786 hartree
nucrepener: 957.62419614 hartree
electener: -1677.44683400 hartree
oneelecener: -2880.78838831 hartree
twoeener: 1203.34155431 hartree
kineticenergy: 716.95548048 hartree
xcener: -66.966041496173 hartree
chargesum: 0.0000000
charge: -0.330641 -0.418939 -0.334395 -0.226310 -0.222946 -0.334271 0.458712 0.009640 -0.197716 0.030423 -0.079305 0.064151 0.413255 -0.195430 0.091311 0.064807 0.093669 0.045607 0.065305 0.113257 0.099144 0.064415 0.062672 0.147478 0.188023 0.108076 0.115231 0.104778
qa: -0.3306 -0.4189 -0.3344 -0.2263 -0.2229 -0.3343 0.4587 0.0096 -0.1977 0.0304 -0.0793 0.0642 0.4133 -0.1954 0.0913 0.0648 0.0937 0.0456 0.0653 0.1133 0.0991 0.0644 0.0627 0.1475 0.1880 0.1081 0.1152 0.1048
va: 2.0365 1.8371 1.9274 3.2060 3.2218 2.7369 4.4208 3.7335 4.0017 4.0098 3.8909 3.9780 4.1769 3.9144 1.0280 1.0088 1.0138 0.9868 0.9883 1.0283 0.9976 0.9863 0.9897 1.0303 1.0641 1.0044 0.9872 0.9847
dispcorr: -0.010615728 hartree
energy: -719.833253588130
dipole: -14.45303 13.13458 -1.31845 6.47133 -4.16946 2.30187 3.64986 -3.02928 0.62058
magnitude: 2.72434 au
magnitude: 6.92472 debye
