program: Orca
programVersion: 5.0.2
elementType: O O O N N N N C C C C C C C H H H H H H H H H H H H H H
charge: 0
multiplicity: 1
keywords: wb97x-d3
keywords: def2-TZVPP
keywords: def2/J RIJCOSX
keywords: DEFGRID2
keywords: scfconv7
keywords: smallprint printgap noloewdin
keywords: NOSOSCF
formula: C7H14N4O3
InChI: InChI=1/C7H14N4O3/c1-8-7(10-11(12)13)9-4-6-2-3-14-5-6/h6,8-9H,2-5H2,1H3
28 atoms
O  -2.82965 0.660672 0.609392
O  3.276779 0.403755 0.52408
O  3.236562 -1.712102 0.235243
N  -0.420918 0.385232 -1.050529
N  1.142882 1.713237 -0.032385
N  1.480397 -0.627387 -0.368518
N  2.715994 -0.630322 0.155244
C  -2.154719 -1.303228 -0.452797
C  -1.686575 -1.390003 1.005996
C  -3.286517 -0.286376 -0.329531
C  -1.051299 -0.866136 -1.417118
C  -2.097465 -0.033032 1.606531
C  0.783837 0.498838 -0.460016
C  0.333677 2.898552 -0.135954
H  -2.534304 -2.263667 -0.810115
H  -0.616684 -1.581171 1.086184
H  -2.197364 -2.20713 1.516518
H  -3.52212 0.232749 -1.263067
H  -4.208124 -0.778723 0.01218
H  -1.466809 -0.757292 -2.422945
H  -0.276005 -1.626255 -1.468354
H  -2.711092 -0.166417 2.504172
H  -1.236639 0.578532 1.887291
H  -1.02689 1.186594 -1.012605
H  2.082018 1.750901 0.342338
H  0.157008 3.195788 -1.173129
H  0.859545 3.713566 0.353161
H  -0.630954 2.786351 0.36596
totalener: -719.82401377 hartree
nucrepener: 997.62554278 hartree
electener: -1717.44955655 hartree
oneelecener: -2960.82239536 hartree
twoeener: 1243.37283881 hartree
kineticenergy: 716.94728288 hartree
xcener: -66.966718061012 hartree
chargesum: 0.0000000
charge: -0.351046 -0.420697 -0.339684 -0.200811 -0.214634 -0.334394 0.465891 0.107831 -0.239634 -0.041988 -0.119813 0.019370 0.372164 -0.192863 0.063601 0.107311 0.096509 0.081798 0.079034 0.105003 0.124446 0.083692 0.076486 0.156078 0.185518 0.116865 0.108600 0.105367
qa: -0.3510 -0.4207 -0.3397 -0.2008 -0.2146 -0.3344 0.4659 0.1078 -0.2396 -0.0420 -0.1198 0.0194 0.3722 -0.1929 0.0636 0.1073 0.0965 0.0818 0.0790 0.1050 0.1244 0.0837 0.0765 0.1561 0.1855 0.1169 0.1086 0.1054
va: 1.9473 1.8349 1.9203 3.2300 3.2102 2.7414 4.4090 3.6897 3.9169 3.9965 3.9366 3.9279 4.2092 3.9092 1.0196 1.0285 1.0076 0.9927 1.0005 0.9961 1.0284 0.9990 0.9875 1.0335 1.0671 0.9866 1.0027 0.9906
dispcorr: -0.012602856 hartree
energy: -719.836616627389
dipole: -16.19841 13.79975 -2.39866 3.82534 -2.60228 1.22306 -0.15969 -0.31171 -0.47141
magnitude: 2.73344 au
magnitude: 6.94785 debye
