program: Orca
programVersion: 5.0.2
elementType: Cl Cl Cl S O O N N N C C C C C C C C C C C C C C C C C C C H H H H H H H H H H H H
charge: 0
multiplicity: 1
keywords: wb97x-d3
keywords: def2-TZVPP
keywords: def2/J RIJCOSX
keywords: DEFGRID2
keywords: scfconv7
keywords: smallprint printgap noloewdin
keywords: NOSOSCF
formula: C19H12Cl3N3O2S
InChI: InChI=1/C19H12Cl3N3O2S/c1-10-3-2-4-24-16(10)25(9-14-8-23-19(22)28-14)18(27)15(17(24)26)11-5-12(20)7-13(21)6-11/h2-8H,9H2,1H3
40 atoms
Cl 4.650416 -0.655911 3.279727
Cl 6.12566 0.719293 -1.695325
Cl -5.014884 1.650554 2.750387
S  -2.718718 0.258882 1.497147
O  0.769209 -2.251472 0.373581
O  1.156179 2.103451 -1.301022
N  -0.968643 -1.234801 -0.670958
N  -0.723486 0.8453 -1.695983
N  -5.099219 -0.67781 1.507481
C  -1.429621 -0.308278 -1.558052
C  1.15752 -0.114289 -0.515089
C  -1.91377 -2.059256 0.093911
C  -2.58469 -0.499131 -2.344187
C  0.376861 -1.259266 -0.233493
C  0.629124 1.013178 -1.133878
C  -1.195673 1.886394 -2.42364
C  2.564088 -0.071198 -0.072121
C  -3.057825 0.583621 -3.056356
C  -3.005459 -1.250967 0.706764
C  -2.387416 1.80329 -3.068459
C  -3.240769 -1.831591 -2.553262
C  3.570628 0.254944 -0.980664
C  2.909069 -0.346266 1.250436
C  -4.317572 -1.57135 0.829935
C  4.237538 -0.302263 1.635518
C  4.887381 0.30342 -0.558296
C  5.250455 0.022772 0.748564
C  -4.389893 0.318109 1.895278
H  -1.328168 -2.540289 0.874181
H  -2.341344 -2.867549 -0.494064
H  -0.563632 2.757677 -2.462786
H  -3.949937 0.459434 -3.656174
H  -2.756943 2.648382 -3.62873
H  -2.512906 -2.637503 -2.626018
H  -3.785924 -1.804219 -3.494897
H  -3.963587 -2.084648 -1.779116
H  3.326498 0.456491 -2.014934
H  2.14474 -0.577423 1.978774
H  -4.762908 -2.472961 0.434987
H  6.284054 0.056422 1.063365
elementType: Cl S O N C H
totalener: -2824.89246418 hartree
nucrepener: 3175.68673955 hartree
electener: -6000.57920373 hartree
twoeener: 4197.98598602 hartree
cpcmener: -0.05787161 hartree
kineticenergy: 2817.93868597 hartree
xcener: -182.980244245503 hartree
chargesum: 0.0000000
charge: -0.088479 -0.088485 -0.026183 0.063064 -0.551519 -0.537948 -0.078565 0.065346 -0.288738 0.146510 -0.141558 -0.005026 -0.145162 0.356965 0.355896 0.078610 0.010528 -0.017699 -0.019196 -0.179235 -0.230719 -0.202514 -0.191805 -0.083254 0.085098 0.090757 -0.163232 0.090456 0.142734 0.152111 0.174158 0.152137 0.170766 0.120415 0.110271 0.121036 0.133473 0.128366 0.161061 0.129562
qa: -0.0885 -0.0885 -0.0262 0.0631 -0.5515 -0.5379 -0.0786 0.0653 -0.2887 0.1465 -0.1416 -0.0050 -0.1452 0.3570 0.3559 0.0786 0.0105 -0.0177 -0.0192 -0.1792 -0.2307 -0.2025 -0.1918 -0.0833 0.0851 0.0908 -0.1632 0.0905 0.1427 0.1521 0.1742 0.1521 0.1708 0.1204 0.1103 0.1210 0.1335 0.1284 0.1611 0.1296
va: 1.2159 1.2158 1.2801 2.7608 1.9691 1.9900 3.1936 3.4469 3.0425 3.9983 3.3648 3.7086 3.8292 4.1551 4.1204 3.8322 3.6184 3.8773 3.7421 3.9596 3.8916 4.0139 4.0155 4.0831 3.8948 3.8829 4.0420 4.2525 1.0299 0.9897 1.0232 0.9950 0.9894 0.9923 1.0027 0.9968 1.0246 1.0332 1.0072 1.0170
dispcorr: -0.024241263 hartree
energy: -2824.916705438892
dipole: -21.23690 16.40825 -4.82865 -10.42049 10.09596 -0.32452 -21.07171 17.73475 -3.33695
magnitude: 5.87847 au
magnitude: 14.94189 debye
