program: Orca
programVersion: 5.0.2
elementType: Cl Cl Cl S O O N N N C C C C C C C C C C C C C C C C C C C H H H H H H H H H H H H
charge: 0
multiplicity: 1
keywords: wb97x-d3
keywords: def2-TZVPP
keywords: def2/J RIJCOSX
keywords: DEFGRID2
keywords: scfconv7
keywords: smallprint printgap noloewdin
keywords: NOSOSCF
formula: C19H12Cl3N3O2S
InChI: InChI=1/C19H12Cl3N3O2S/c1-10-3-2-4-24-16(10)25(9-14-8-23-19(22)28-14)18(27)15(17(24)26)11-5-12(20)7-13(21)6-11/h2-8H,9H2,1H3
40 atoms
Cl 4.124673 2.399077 2.444716
Cl 4.974809 -2.390661 0.172686
Cl -3.352277 -0.924315 4.488676
S  -2.890677 -1.932903 1.74055
O  -0.093497 -1.665188 -0.120776
O  1.195589 2.534269 -1.758345
N  -1.399328 -0.50831 -1.547635
N  -0.691117 1.479134 -2.530915
N  -3.062159 0.55052 2.314297
C  -1.553576 0.4276 -2.521744
C  0.751764 0.373583 -0.933923
C  -2.559522 -1.197229 -0.969593
C  -2.521568 0.329224 -3.544568
C  -0.200384 -0.667329 -0.826959
C  0.510372 1.524552 -1.676986
C  -0.842249 2.514856 -3.393808
C  2.01132 0.259358 -0.179018
C  -2.666249 1.40265 -4.395902
C  -2.747969 -0.794092 0.459614
C  -1.8492 2.52675 -4.302672
C  -3.314813 -0.914555 -3.824529
C  2.812122 -0.872392 -0.332639
C  2.425422 1.267573 0.6908
C  -2.86295 0.460089 0.965319
C  3.620277 1.133402 1.376357
C  3.994529 -0.978454 0.376725
C  4.425552 0.014766 1.240735
C  -3.102248 -0.624618 2.829806
H  -2.463994 -2.275115 -1.079263
H  -3.451103 -0.900256 -1.508163
H  -0.111267 3.301947 -3.316652
H  -3.404934 1.343011 -5.184851
H  -1.959211 3.365304 -4.972865
H  -3.496854 -0.976772 -4.896015
H  -4.289713 -0.912598 -3.336261
H  -2.789078 -1.821043 -3.532077
H  2.521033 -1.65757 -1.016327
H  1.812201 2.144043 0.845617
H  -2.805079 1.364229 0.375945
H  5.35413 -0.079221 1.785963
elementType: Cl S O N C H
totalener: -2824.89240296 hartree
nucrepener: 3167.42145625 hartree
electener: -5992.31385921 hartree
twoeener: 4191.06515383 hartree
cpcmener: -0.06395788 hartree
kineticenergy: 2817.94927842 hartree
xcener: -182.981663743996 hartree
chargesum: 0.0000000
charge: -0.088833 -0.088759 -0.032455 0.089356 -0.542953 -0.542972 -0.051388 0.030639 -0.295247 0.223832 -0.127433 -0.009611 -0.117003 0.280451 0.368645 0.070955 0.025529 -0.026858 -0.014102 -0.181473 -0.251208 -0.203434 -0.204315 -0.087355 0.086769 0.092013 -0.163795 0.073219 0.124171 0.164212 0.172956 0.151616 0.170518 0.114702 0.118153 0.124687 0.130988 0.130959 0.156983 0.127838
qa: -0.0888 -0.0888 -0.0325 0.0894 -0.5430 -0.5430 -0.0514 0.0306 -0.2952 0.2238 -0.1274 -0.0096 -0.1170 0.2805 0.3686 0.0710 0.0255 -0.0269 -0.0141 -0.1815 -0.2512 -0.2034 -0.2043 -0.0874 0.0868 0.0920 -0.1638 0.0732 0.1242 0.1642 0.1730 0.1516 0.1705 0.1147 0.1182 0.1247 0.1310 0.1310 0.1570 0.1278
va: 1.2159 1.2162 1.2743 2.7807 1.9806 1.9831 3.2053 3.4701 3.0407 3.9825 3.3846 3.7814 3.8021 4.2322 4.1160 3.8387 3.6248 3.8759 3.7423 3.9533 3.9140 4.0233 4.0268 4.0710 3.8934 3.8866 4.0454 4.2531 1.0072 0.9798 1.0240 0.9947 0.9899 0.9993 0.9929 0.9951 1.0286 1.0301 1.0093 1.0176
dispcorr: -0.023187368 hartree
energy: -2824.915590330424
dipole: -21.74984 16.78106 -4.96878 3.73541 -3.57842 0.15699 -33.84988 28.44914 -5.40075
magnitude: 7.34040 au
magnitude: 18.65782 debye
