program: Orca
programVersion: 5.0.2
elementType: Cl Cl Cl S O O N N N C C C C C C C C C C C C C C C C C C C H H H H H H H H H H H H
charge: 0
multiplicity: 1
keywords: wb97x-d3
keywords: def2-TZVPP
keywords: def2/J RIJCOSX
keywords: DEFGRID2
keywords: scfconv7
keywords: smallprint printgap noloewdin
keywords: NOSOSCF
formula: C19H12Cl3N3O2S
InChI: InChI=1/C19H12Cl3N3O2S/c1-10-3-2-4-24-16(10)25(9-14-8-23-19(22)28-14)18(27)15(17(24)26)11-5-12(20)7-13(21)6-11/h2-8H,9H2,1H3
40 atoms
Cl 3.052831 -1.022111 3.448028
Cl 5.893514 0.558124 -0.825434
Cl -2.801698 -1.721995 4.355524
S  -2.800985 0.52773 2.417788
O  -0.334755 1.630703 0.670641
O  1.388872 -1.086862 -2.741086
N  -1.548636 1.098709 -1.152277
N  -0.609162 0.018445 -2.981274
N  -2.725298 -1.927621 1.723439
C  -1.609615 0.782484 -2.469576
C  0.72344 0.328093 -0.980476
C  -2.761047 1.214745 -0.32982
C  -2.625991 1.246707 -3.335452
C  -0.341958 1.065929 -0.414421
C  0.606135 -0.319484 -2.207286
C  -0.640647 -0.436201 -4.257292
C  1.968925 0.153363 -0.211089
C  -2.644697 0.75725 -4.622499
C  -2.76503 0.162302 0.736493
C  -1.667718 -0.12133 -5.086609
C  -3.608566 2.317979 -2.959228
C  3.203761 0.420067 -0.800786
C  1.931354 -0.294438 1.109253
C  -2.724471 -1.186025 0.578068
C  3.112833 -0.464135 1.808733
C  4.366469 0.230873 -0.075067
C  4.349001 -0.210096 1.23747
C  -2.77605 -1.156925 2.747962
H  -3.62799 1.047083 -0.95879
H  -2.853391 2.214697 0.088596
H  0.1991 -1.0413 -4.557794
H  -3.415595 1.103237 -5.299628
H  -1.680217 -0.501438 -6.096922
H  -3.847786 2.901728 -3.847037
H  -3.212098 3.00957 -2.218242
H  -4.549836 1.916265 -2.582007
H  3.254533 0.782447 -1.818359
H  0.986713 -0.525862 1.581572
H  -2.684212 -1.689951 -0.37753
H  5.264419 -0.350938 1.795162
elementType: Cl S O N C H
totalener: -2824.89903125 hartree
nucrepener: 3195.04571520 hartree
electener: -6019.94474645 hartree
twoeener: 4218.57364990 hartree
cpcmener: -0.05133186 hartree
kineticenergy: 2817.94415745 hartree
xcener: -182.977267762311 hartree
chargesum: -0.0000000
charge: -0.087504 -0.089824 -0.031035 0.094496 -0.496396 -0.505127 -0.055823 0.027188 -0.281222 0.221948 -0.133562 -0.013281 -0.124408 0.261226 0.332429 0.071518 0.040117 -0.031484 -0.002405 -0.184961 -0.246519 -0.199184 -0.192900 -0.107110 0.091266 0.095189 -0.172774 0.070584 0.155558 0.123810 0.172101 0.149350 0.167514 0.113296 0.122378 0.115691 0.127640 0.125120 0.150909 0.126191
qa: -0.0875 -0.0898 -0.0310 0.0945 -0.4964 -0.5051 -0.0558 0.0272 -0.2812 0.2219 -0.1336 -0.0133 -0.1244 0.2612 0.3324 0.0715 0.0401 -0.0315 -0.0024 -0.1850 -0.2465 -0.1992 -0.1929 -0.1071 0.0913 0.0952 -0.1728 0.0706 0.1556 0.1238 0.1721 0.1493 0.1675 0.1133 0.1224 0.1157 0.1276 0.1251 0.1509 0.1262
va: 1.2187 1.2145 1.2743 2.7808 2.0353 2.0307 3.1734 3.4552 3.0331 3.9935 3.3413 3.8041 3.7998 4.2401 4.1542 3.8377 3.5965 3.8809 3.7473 3.9540 3.9124 4.0212 4.0275 4.0839 3.8956 3.8760 4.0494 4.2519 0.9845 1.0041 1.0259 0.9954 0.9910 0.9995 0.9955 0.9937 1.0261 1.0241 1.0116 1.0182
dispcorr: -0.023916537 hartree
energy: -2824.922947787270
dipole: -23.55790 18.67896 -4.87894 11.24542 -9.39505 1.85037 -32.25232 27.58316 -4.66916
magnitude: 7.00207 au
magnitude: 17.79786 debye
