program: Orca
programVersion: 5.0.2
elementType: Cl Cl Cl S O O N N N C C C C C C C C C C C C C C C C C C C H H H H H H H H H H H H
charge: 0
multiplicity: 1
keywords: wb97x-d3
keywords: def2-TZVPP
keywords: def2/J RIJCOSX
keywords: DEFGRID2
keywords: scfconv7
keywords: smallprint printgap noloewdin
keywords: NOSOSCF
formula: C19H12Cl3N3O2S
InChI: InChI=1/C19H12Cl3N3O2S/c1-10-3-2-4-24-16(10)25(9-14-8-23-19(22)28-14)18(27)15(17(24)26)11-5-12(20)7-13(21)6-11/h2-8H,9H2,1H3
40 atoms
Cl 5.234284 2.470745 2.011554
Cl 5.812023 -2.362872 -0.243592
Cl -6.180205 -0.296676 2.831762
S  -4.312176 -1.785969 1.071158
O  0.798812 -1.923257 0.275005
O  1.446807 2.431473 -1.342351
N  -0.864691 -0.813156 -0.802988
N  -0.520485 1.298185 -1.692307
N  -3.811231 0.536916 2.012193
C  -1.298578 0.188804 -1.601023
C  1.331596 0.211922 -0.541324
C  -1.792912 -1.752647 -0.184008
C  -2.503036 0.15308 -2.355419
C  0.494351 -0.907004 -0.313271
C  0.881902 1.378953 -1.150097
C  -0.930447 2.417411 -2.331841
C  2.725463 0.16019 -0.061889
C  -2.908037 1.314491 -2.972267
C  -2.807831 -1.046139 0.656457
C  -2.143119 2.478382 -2.936742
C  -3.299737 -1.091834 -2.62548
C  3.524662 -0.947785 -0.338802
C  3.266749 1.217329 0.667754
C  -2.735757 0.170227 1.256973
C  4.578019 1.153028 1.102629
C  4.831378 -0.982518 0.110787
C  5.383789 0.060139 0.83483
C  -4.698828 -0.382152 2.001939
H  -1.16985 -2.396968 0.436185
H  -2.259848 -2.410916 -0.911731
H  -0.214957 3.224684 -2.31668
H  -3.833106 1.304338 -3.534314
H  -2.465086 3.387142 -3.421198
H  -2.660935 -1.932308 -2.892354
H  -3.95273 -0.914574 -3.477828
H  -3.940156 -1.386444 -1.794712
H  3.133735 -1.779261 -0.905601
H  2.671132 2.086891 0.901019
H  -1.894673 0.845574 1.187131
H  6.406977 0.021841 1.178921
totalener: -2824.86108736 hartree
nucrepener: 3123.09284761 hartree
electener: -5947.95393497 hartree
twoeener: 4145.14064377 hartree
kineticenergy: 2817.99074356 hartree
xcener: -182.980141518796 hartree
chargesum: -0.0000000
charge: -0.081807 -0.082999 -0.012291 0.052443 -0.401483 -0.405456 -0.056744 0.029346 -0.225626 0.128153 -0.188422 -0.060020 -0.154836 0.277433 0.294369 0.054799 0.086689 -0.015139 -0.040514 -0.159146 -0.240553 -0.148975 -0.144911 -0.034959 0.077029 0.081439 -0.165609 0.065142 0.156289 0.125428 0.174829 0.117852 0.141938 0.112158 0.094416 0.114326 0.099908 0.102996 0.122027 0.110479
qa: -0.0818 -0.0830 -0.0123 0.0524 -0.4015 -0.4055 -0.0567 0.0293 -0.2256 0.1282 -0.1884 -0.0600 -0.1548 0.2774 0.2944 0.0548 0.0867 -0.0151 -0.0405 -0.1591 -0.2406 -0.1490 -0.1449 -0.0350 0.0770 0.0814 -0.1656 0.0651 0.1563 0.1254 0.1748 0.1179 0.1419 0.1122 0.0944 0.1143 0.0999 0.1030 0.1220 0.1105
va: 1.2232 1.2220 1.2926 2.7336 2.1319 2.1307 3.2193 3.4546 3.0800 4.0875 3.4464 3.7095 3.8252 4.1813 4.1196 3.8491 3.6244 3.9094 3.6983 3.9643 3.8908 4.0532 4.0421 4.0633 3.9545 3.9460 4.0635 4.2514 1.0443 0.9917 1.0331 1.0073 1.0019 0.9918 1.0118 1.0103 1.0365 1.0365 1.0195 1.0227
dispcorr: -0.023574048 hartree
energy: -2824.884661405328
dipole: -16.11162 12.36425 -3.74737 0.29933 -0.43499 -0.13566 -21.26780 18.89662 -2.37118
magnitude: 4.43663 au
magnitude: 11.27702 debye
