program: Orca
programVersion: 5.0.3
elementType: Cl N N N N C C C C C C C C C C H H H H H H H H H H H
charge: 0
multiplicity: 1
keywords: wb97x-d3
keywords: def2-TZVPP
keywords: def2/J RIJCOSX
keywords: DEFGRID2
keywords: scfconv7
keywords: smallprint printgap noloewdin
keywords: NOSOSCF
formula: C10H11ClN4
InChI: InChI=1/C10H11ClN4/c1-8(14-7-12)15(2)6-9-3-4-10(11)13-5-9/h3-5H,6H2,1-2H3
26 atoms
Cl -4.54471 0.653231 0.614249
N  1.767302 -1.132567 -0.234926
N  -1.945416 0.776952 0.627031
N  2.958137 0.799688 -0.372139
N  4.680715 2.416089 0.335696
C  0.901102 -0.725923 -1.329842
C  -0.49503 -0.414079 -0.861671
C  2.716383 -0.332392 0.245607
C  1.384494 -2.357829 0.448979
C  -1.603544 -0.991351 -1.468211
C  -0.730992 0.462369 0.188735
C  3.45987 -0.789491 1.457776
C  -2.875572 -0.672373 -1.026602
C  -2.970336 0.220909 0.026069
C  3.886196 1.61154 0.054423
H  0.866856 -1.534635 -2.061213
H  1.339291 0.137627 -1.824455
H  0.822683 -2.158476 1.362291
H  2.253953 -2.962553 0.695598
H  0.755747 -2.944925 -0.21551
H  -1.477239 -1.691238 -2.284687
H  0.0913 0.941398 0.707726
H  4.013334 -1.7051 1.245478
H  2.773897 -1.003808 2.27716
H  4.169848 -0.039745 1.796863
H  -3.754549 -1.107354 -1.479696
elementType: Cl N C H
totalener: -1066.95096695 hartree
nucrepener: 1013.87135312 hartree
electener: -2080.82232007 hartree
oneelecener: -3467.88473925 hartree
twoeener: 1387.06241918 hartree
cpcmener: -0.04656448 hartree
kineticenergy: 1063.62751568 hartree
xcener: -80.302217275619 hartree
chargesum: -0.0000000
charge: -0.091282 -0.112885 -0.334105 -0.442003 -0.283005 0.014822 -0.016889 0.356257 -0.186998 -0.154825 0.023783 -0.241359 -0.141509 0.179217 0.026238 0.128609 0.123840 0.129991 0.129557 0.118137 0.152224 0.131488 0.125339 0.121285 0.093627 0.150446
qa: -0.0913 -0.1129 -0.3341 -0.4420 -0.2830 0.0148 -0.0169 0.3563 -0.1870 -0.1548 0.0238 -0.2414 -0.1415 0.1792 0.0262 0.1286 0.1238 0.1300 0.1296 0.1181 0.1522 0.1315 0.1253 0.1213 0.0936 0.1504
va: 1.2112 3.2767 3.0474 2.9025 3.1203 3.7515 3.6399 3.8584 3.8845 4.0049 4.0256 3.9603 3.9431 4.1316 4.3801 0.9939 1.0285 0.9850 0.9921 0.9969 1.0019 1.0176 0.9973 0.9975 1.0232 1.0022
dispcorr: -0.011238099 hartree
energy: -1066.962205045710
dipole: 17.28585 -18.66356 -1.37771 -14.10582 9.18127 -4.92455 -0.60755 -0.24894 -0.85649
magnitude: 5.18487 au
magnitude: 13.17888 debye
