program: Orca
programVersion: 5.0.3
elementType: Cl N N N N C C C C C C C C C C H H H H H H H H H H H
charge: 0
multiplicity: 1
keywords: wb97x-d3
keywords: def2-TZVPP
keywords: def2/J RIJCOSX
keywords: DEFGRID2
keywords: scfconv7
keywords: smallprint printgap noloewdin
keywords: NOSOSCF
formula: C10H11ClN4
InChI: InChI=1/C10H11ClN4/c1-8(14-7-12)15(2)6-9-3-4-10(11)13-5-9/h3-5H,6H2,1-2H3
26 atoms
Cl -4.568797 0.674744 0.579676
N  1.747912 -1.122654 -0.201238
N  -1.972415 0.81946 0.587039
N  2.931265 0.809684 -0.331486
N  4.678945 2.415292 0.329523
C  0.895734 -0.715385 -1.306696
C  -0.506576 -0.402346 -0.858236
C  2.714696 -0.334539 0.266554
C  1.392849 -2.371716 0.450528
C  -1.608901 -1.003381 -1.452776
C  -0.754196 0.506714 0.163169
C  3.492635 -0.81426 1.450131
C  -2.885725 -0.682268 -1.025813
C  -2.991872 0.238185 0.002726
C  3.870227 1.625208 0.061885
H  0.8741 -1.523779 -2.040052
H  1.342389 0.1496 -1.792441
H  0.830542 -2.20842 1.371157
H  2.273716 -2.968004 0.678495
H  0.771407 -2.954469 -0.225231
H  -1.475642 -1.723502 -2.250911
H  0.06287 1.014346 0.664446
H  4.053964 -1.716978 1.204026
H  2.831968 -1.056419 2.282782
H  4.201872 -0.06405 1.790263
H  -3.759239 -1.1351 -1.472799
elementType: Cl N C H
totalener: -1066.95641989 hartree
nucrepener: 1012.67203807 hartree
electener: -2079.62845796 hartree
oneelecener: -3465.59759208 hartree
twoeener: 1385.96913412 hartree
cpcmener: -0.03932137 hartree
kineticenergy: 1063.63960344 hartree
xcener: -80.304278056229 hartree
chargesum: 0.0000000
charge: -0.087620 -0.112929 -0.324808 -0.440825 -0.257592 0.008654 -0.020727 0.357957 -0.187871 -0.153918 0.021719 -0.245997 -0.142603 0.179254 0.014614 0.127050 0.125650 0.129356 0.128239 0.115636 0.148656 0.130957 0.122641 0.119875 0.096382 0.148252
qa: -0.0876 -0.1129 -0.3248 -0.4408 -0.2576 0.0087 -0.0207 0.3580 -0.1879 -0.1539 0.0217 -0.2460 -0.1426 0.1793 0.0146 0.1271 0.1256 0.1294 0.1282 0.1156 0.1487 0.1310 0.1226 0.1199 0.0964 0.1483
va: 1.2143 3.2661 3.0531 2.9066 3.1253 3.7543 3.6362 3.8496 3.8866 4.0028 4.0317 3.9621 3.9498 4.1340 4.3759 0.9933 1.0297 0.9848 0.9920 0.9975 1.0031 1.0180 0.9973 0.9972 1.0233 1.0032
dispcorr: -0.011184246 hartree
energy: -1066.967604140684
dipole: 17.55797 -18.82268 -1.26471 -14.32284 9.56636 -4.75648 -0.54409 -0.25600 -0.80008
magnitude: 4.98636 au
magnitude: 12.67431 debye
